program: Orca
programVersion: 5.0.3
elementType: Cl Cl O O O C C C C C C C C C C C C C C C C C C C C C H H H H H H H H H H H H H H H H H H H H
charge: 0
multiplicity: 1
keywords: wb97x-d3
keywords: def2-TZVPP
keywords: def2/J RIJCOSX
keywords: DEFGRID2
keywords: scfconv7
keywords: smallprint printgap noloewdin
keywords: NOSOSCF
formula: C21H20Cl2O3
InChI: InChI=1/C21H20Cl2O3/c1-21(2)17(12-18(22)23)19(21)20(24)25-13-14-7-6-10-16(11-14)26-15-8-4-3-5-9-15/h3-12,17,19H,13H2,1-2H3
46 atoms
Cl 3.270038 -0.07018 -2.42643
Cl 4.668896 0.731774 -0.035109
O  -1.794897 -2.097347 0.95815
O  -1.279213 -2.206065 -1.217472
O  -2.412366 2.932394 0.700222
C  1.424009 -3.325258 -0.057901
C  1.587862 -1.897106 -0.494908
C  0.453693 -2.272715 0.43392
C  2.3607 -3.900341 0.978147
C  1.006234 -4.334691 -1.099503
C  2.672042 -1.047355 0.011289
C  -0.938633 -2.187874 -0.067067
C  3.43583 -0.251904 -0.726103
C  -3.170245 -1.929943 0.642953
C  -3.506277 -0.528926 0.208574
C  -2.759015 0.550807 0.65892
C  -4.611608 -0.310434 -0.603217
C  -3.109348 1.840023 0.280045
C  -4.969959 0.982622 -0.951122
C  -4.22127 2.064577 -0.519699
C  -1.068328 2.801231 0.923932
C  -0.213761 2.404619 -0.096924
C  -0.573085 3.107681 2.180818
C  1.146081 2.317255 0.15006
C  0.792457 3.019064 2.415095
C  1.654957 2.619278 1.406247
H  1.281227 -1.702218 -1.516146
H  0.569007 -1.99486 1.47588
H  3.298658 -4.212389 0.51628
H  2.602237 -3.198447 1.775371
H  1.911715 -4.777669 1.446156
H  0.441032 -5.149761 -0.643649
H  0.395145 -3.904659 -1.88847
H  1.893389 -4.768857 -1.563154
H  2.871686 -1.051241 1.075498
H  -3.486098 -2.64792 -0.117348
H  -3.694841 -2.171052 1.569034
H  -1.901436 0.392976 1.300297
H  -5.188265 -1.149111 -0.973069
H  -5.830004 1.150142 -1.585804
H  -4.483606 3.075295 -0.80255
H  -0.609422 2.168858 -1.076614
H  -1.253566 3.41631 2.963465
H  1.811067 2.019998 -0.648912
H  1.179673 3.260171 3.396347
H  2.71827 2.547023 1.590033
totalener: -1958.42635165 hartree
nucrepener: 2628.15090530 hartree
electener: -4586.57725695 hartree
oneelecener: -7909.40863856 hartree
twoeener: 3322.83138162 hartree
kineticenergy: 1952.62386478 hartree
xcener: -143.517160423596 hartree
chargesum: 0.0000000
charge: -0.044371 -0.052282 -0.279575 -0.367994 -0.302110 0.060261 0.063116 -0.063607 -0.242491 -0.249332 -0.192159 0.318356 0.031661 0.062916 0.064733 -0.177447 -0.196516 0.208425 -0.083151 -0.207668 0.223692 -0.152650 -0.194874 -0.118601 -0.110981 -0.133180 0.087003 0.077128 0.098872 0.071527 0.093150 0.086684 0.103536 0.087627 0.095656 0.103288 0.108686 0.124989 0.103923 0.123083 0.124540 0.133644 0.125174 0.138938 0.125066 0.123316
qa: -0.0444 -0.0523 -0.2796 -0.3680 -0.3021 0.0603 0.0631 -0.0636 -0.2425 -0.2493 -0.1922 0.3184 0.0317 0.0629 0.0647 -0.1774 -0.1965 0.2084 -0.0832 -0.2077 0.2237 -0.1527 -0.1949 -0.1186 -0.1110 -0.1332 0.0870 0.0771 0.0989 0.0715 0.0932 0.0867 0.1035 0.0876 0.0957 0.1033 0.1087 0.1250 0.1039 0.1231 0.1245 0.1336 0.1252 0.1389 0.1251 0.1233
va: 1.2811 1.2516 2.1200 2.1335 2.1033 3.8086 3.7863 3.8308 3.9106 3.9129 3.9012 4.2566 4.2301 3.8618 3.6820 3.9037 4.0362 3.8517 3.9539 4.0412 3.8255 3.9710 4.0336 3.8829 3.9741 3.9311 1.0490 1.0362 1.0028 1.0099 1.0043 1.0020 1.0223 1.0014 1.0313 1.0122 0.9855 1.0255 1.0116 0.9991 1.0128 1.0063 1.0124 0.9993 0.9996 1.0122
dispcorr: -0.026085337 hartree
energy: -1958.452436982641
dipole: -17.38612 17.33488 -0.05123 -17.59753 16.66250 -0.93502 9.45001 -8.65058 0.79943
magnitude: 1.23125 au
magnitude: 3.12959 debye
