program: Orca
programVersion: 5.0.3
elementType: Cl Cl O O O C C C C C C C C C C C C C C C C C C C C C H H H H H H H H H H H H H H H H H H H H
charge: 0
multiplicity: 1
keywords: wb97x-d3
keywords: def2-TZVPP
keywords: def2/J RIJCOSX
keywords: DEFGRID2
keywords: scfconv7
keywords: smallprint printgap noloewdin
keywords: NOSOSCF
formula: C21H20Cl2O3
InChI: InChI=1/C21H20Cl2O3/c1-21(2)17(12-18(22)23)19(21)20(24)25-13-14-7-6-10-16(11-14)26-15-8-4-3-5-9-15/h3-12,17,19H,13H2,1-2H3
46 atoms
Cl 3.0347 -4.471306 1.222938
Cl 4.60835 -4.852942 -1.164675
O  -1.597571 -1.241187 -1.778794
O  -1.13592 -1.85218 0.322388
O  -2.498548 3.619324 -0.562137
C  1.64976 -0.607163 -0.552815
C  1.718314 -2.095984 -0.35879
C  0.642531 -1.505856 -1.240673
C  2.651992 0.080727 -1.448236
C  1.237933 0.240134 0.626607
C  2.774496 -2.918374 -0.961029
C  -0.76516 -1.566855 -0.78293
C  3.384296 -3.940108 -0.372525
C  -2.978362 -1.144436 -1.446049
C  -3.280824 0.068068 -0.610169
C  -2.726998 1.301149 -0.940698
C  -4.126274 -0.027429 0.484809
C  -3.028292 2.418445 -0.181811
C  -4.433376 1.101014 1.231786
C  -3.886818 2.330165 0.907016
C  -1.699128 4.303466 0.303082
C  -0.995184 3.692808 1.334315
C  -1.580141 5.670853 0.086129
C  -0.17541 4.464688 2.14541
C  -0.754635 6.42536 0.901973
C  -0.049584 5.828961 1.938219
H  1.357769 -2.440112 0.603566
H  0.770704 -1.600956 -2.313537
H  2.261303 1.043329 -1.781082
H  3.581572 0.268105 -0.908413
H  2.898807 -0.493104 -2.34082
H  0.752723 1.158867 0.290314
H  0.557447 -0.274376 1.300877
H  2.121744 0.526112 1.19919
H  3.089247 -2.690954 -1.971976
H  -3.487927 -1.082093 -2.408543
H  -3.321033 -2.050788 -0.942196
H  -2.058505 1.403514 -1.786855
H  -4.539477 -0.988188 0.763968
H  -5.097921 1.020034 2.08163
H  -4.120187 3.211708 1.490126
H  -1.079405 2.628289 1.510487
H  -2.134161 6.130974 -0.721399
H  0.372182 3.985667 2.946315
H  -0.666958 7.489708 0.727859
H  0.590931 6.422213 2.576038
totalener: -1958.42615372 hartree
nucrepener: 2489.48087860 hartree
electener: -4447.90703232 hartree
oneelecener: -7631.99368331 hartree
twoeener: 3184.08665099 hartree
kineticenergy: 1952.62782938 hartree
xcener: -143.515438111000 hartree
chargesum: -0.0000000
charge: -0.041037 -0.049377 -0.270941 -0.365153 -0.300446 0.073993 0.044579 -0.070696 -0.247879 -0.253716 -0.207093 0.321037 0.052247 0.064570 0.055645 -0.270735 -0.138226 0.224162 -0.104701 -0.151693 0.273426 -0.191755 -0.209295 -0.136312 -0.091579 -0.145247 0.084012 0.077744 0.095918 0.098238 0.072034 0.079775 0.104321 0.092996 0.096059 0.109640 0.103982 0.119908 0.106818 0.127589 0.134385 0.135909 0.123887 0.125429 0.124163 0.123415
qa: -0.0410 -0.0494 -0.2709 -0.3652 -0.3004 0.0740 0.0446 -0.0707 -0.2479 -0.2537 -0.2071 0.3210 0.0522 0.0646 0.0556 -0.2707 -0.1382 0.2242 -0.1047 -0.1517 0.2734 -0.1918 -0.2093 -0.1363 -0.0916 -0.1452 0.0840 0.0777 0.0959 0.0982 0.0720 0.0798 0.1043 0.0930 0.0961 0.1096 0.1040 0.1199 0.1068 0.1276 0.1344 0.1359 0.1239 0.1254 0.1242 0.1234
va: 1.2865 1.2557 2.1211 2.1383 2.1007 3.7711 3.8365 3.8320 3.9070 3.9133 3.9273 4.2875 4.2467 3.8570 3.6540 4.0357 4.0104 3.8371 3.9472 3.9861 3.7775 3.8988 4.0239 3.9835 3.9440 3.9627 1.0536 1.0346 1.0038 1.0031 1.0096 1.0014 1.0184 1.0045 1.0309 0.9888 1.0097 1.0298 1.0131 1.0003 1.0021 1.0025 1.0149 1.0013 0.9987 1.0007
dispcorr: -0.023398117 hartree
energy: -1958.449551834296
dipole: -17.23380 16.92076 -0.31304 35.08192 -34.32164 0.76027 0.89408 -1.24634 -0.35226
magnitude: 0.89448 au
magnitude: 2.27359 debye
