program: Orca
programVersion: 5.0.3
elementType: Cl Cl O O O C C C C C C C C C C C C C C C C C C C C C H H H H H H H H H H H H H H H H H H H H
charge: 0
multiplicity: 1
keywords: wb97x-d3
keywords: def2-TZVPP
keywords: def2/J RIJCOSX
keywords: DEFGRID2
keywords: scfconv7
keywords: smallprint printgap noloewdin
keywords: NOSOSCF
formula: C21H20Cl2O3
InChI: InChI=1/C21H20Cl2O3/c1-21(2)17(12-18(22)23)19(21)20(24)25-13-14-7-6-10-16(11-14)26-15-8-4-3-5-9-15/h3-12,17,19H,13H2,1-2H3
46 atoms
Cl 3.659703 -0.116991 -1.927684
Cl 4.662419 0.571347 0.691345
O  -2.022342 -2.180139 0.818826
O  -1.419926 -1.858191 -1.313416
O  -2.575856 2.837325 0.834506
C  1.27044 -3.119827 -0.30603
C  1.406339 -1.626435 -0.396096
C  0.2484 -2.224409 0.365616
C  2.192924 -3.880501 0.616255
C  0.933997 -3.88112 -1.564587
C  2.459904 -0.908726 0.340185
C  -1.124155 -2.06199 -0.168053
C  3.462556 -0.250711 -0.225612
C  -3.389325 -1.998466 0.47945
C  -3.746089 -0.565482 0.188295
C  -2.980131 0.478192 0.682602
C  -4.883593 -0.285903 -0.560943
C  -3.323997 1.790486 0.385061
C  -5.245728 1.027379 -0.81003
C  -4.462269 2.075322 -0.351816
C  -1.21495 2.778672 0.730894
C  -0.479896 3.403231 1.728086
C  -0.57202 2.166793 -0.340215
C  0.904619 3.417105 1.651247
C  0.812676 2.183514 -0.398511
C  1.558437 2.804214 0.593218
H  1.141836 -1.207463 -1.361208
H  0.310947 -2.191309 1.448081
H  3.157916 -4.048853 0.1356
H  2.38142 -3.36187 1.555708
H  1.766717 -4.854782 0.859788
H  0.323367 -3.309475 -2.258104
H  1.85645 -4.155769 -2.078625
H  0.401616 -4.804369 -1.328333
H  2.430378 -0.911463 1.422849
H  -3.664449 -2.630815 -0.368377
H  -3.937944 -2.354806 1.352914
H  -2.1002 0.28259 1.282314
H  -5.48217 -1.09525 -0.960763
H  -6.131975 1.239968 -1.392974
H  -4.719868 3.103464 -0.568201
H  -0.995699 3.875977 2.553577
H  -1.139516 1.679325 -1.122537
H  1.474191 3.905599 2.430971
H  1.311119 1.711658 -1.235107
H  2.638382 2.808763 0.540312
totalener: -1958.42573335 hartree
nucrepener: 2639.28299802 hartree
electener: -4597.70873138 hartree
oneelecener: -7931.69354786 hartree
twoeener: 3333.98481649 hartree
kineticenergy: 1952.62127952 hartree
xcener: -143.517934577035 hartree
chargesum: 0.0000000
charge: -0.044789 -0.046450 -0.278541 -0.367189 -0.301847 0.095307 -0.014617 -0.060657 -0.232213 -0.256759 -0.139590 0.301580 0.007820 0.059421 0.084903 -0.213188 -0.197869 0.235469 -0.085453 -0.210946 0.263306 -0.217014 -0.177927 -0.095135 -0.125092 -0.144054 0.093606 0.078840 0.097653 0.072088 0.093949 0.103375 0.088617 0.087366 0.105275 0.104506 0.112139 0.128073 0.105132 0.124186 0.124962 0.123035 0.136356 0.123817 0.130979 0.127569
qa: -0.0448 -0.0465 -0.2785 -0.3672 -0.3018 0.0953 -0.0146 -0.0607 -0.2322 -0.2568 -0.1396 0.3016 0.0078 0.0594 0.0849 -0.2132 -0.1979 0.2355 -0.0855 -0.2109 0.2633 -0.2170 -0.1779 -0.0951 -0.1251 -0.1441 0.0936 0.0788 0.0977 0.0721 0.0939 0.1034 0.0886 0.0874 0.1053 0.1045 0.1121 0.1281 0.1051 0.1242 0.1250 0.1230 0.1364 0.1238 0.1310 0.1276
va: 1.2796 1.2596 2.1212 2.1269 2.1121 3.8091 3.8165 3.8599 3.9063 3.9097 3.8073 4.2510 4.2227 3.8625 3.6314 3.9585 4.0395 3.8368 3.9442 4.0579 3.7814 4.0432 3.9179 3.9676 3.9022 3.9292 1.0379 1.0375 1.0043 1.0083 1.0050 1.0228 1.0023 1.0021 1.0245 1.0090 0.9857 1.0197 1.0105 0.9992 1.0120 1.0144 1.0091 0.9989 1.0069 1.0159
dispcorr: -0.027119120 hartree
energy: -1958.452852472743
dipole: -19.49485 19.24383 -0.25102 -15.78573 14.77948 -1.00625 2.75443 -2.20844 0.54599
magnitude: 1.17203 au
magnitude: 2.97906 debye
