program: Orca
programVersion: 5.0.3
elementType: Cl Cl O O O C C C C C C C C C C C C C C C C C C C C C H H H H H H H H H H H H H H H H H H H H
charge: 0
multiplicity: 1
keywords: wb97x-d3
keywords: def2-TZVPP
keywords: def2/J RIJCOSX
keywords: DEFGRID2
keywords: scfconv7
keywords: smallprint printgap noloewdin
keywords: NOSOSCF
formula: C21H20Cl2O3
InChI: InChI=1/C21H20Cl2O3/c1-21(2)17(12-18(22)23)19(21)20(24)25-13-14-7-6-10-16(11-14)26-15-8-4-3-5-9-15/h3-12,17,19H,13H2,1-2H3
46 atoms
Cl 4.750144 -1.569694 0.601261
Cl 5.075878 -4.372618 -0.001143
O  -1.601391 -2.021088 0.748771
O  -0.178503 -0.295669 0.820415
O  -3.495357 3.365254 0.247341
C  0.971788 -1.683668 -1.738595
C  1.848825 -1.946266 -0.548391
C  0.364851 -2.234847 -0.464352
C  1.013944 -2.624324 -2.919507
C  0.743818 -0.247329 -2.144003
C  2.80001 -3.06333 -0.501727
C  -0.468132 -1.394886 0.427182
C  4.039278 -3.000582 -0.029693
C  -2.546753 -1.286897 1.533106
C  -3.264949 -0.265107 0.69858
C  -3.034132 1.088163 0.896968
C  -4.140892 -0.679106 -0.300085
C  -3.661176 2.024245 0.083514
C  -4.775786 0.260805 -1.094214
C  -4.533376 1.613745 -0.913776
C  -2.270954 3.903877 0.516689
C  -2.272045 5.118866 1.190294
C  -1.073236 3.328829 0.108779
C  -1.072516 5.757756 1.456482
C  0.120141 3.975718 0.394119
C  0.130969 5.188717 1.065114
H  2.15522 -1.054746 -0.013392
H  0.063537 -3.275634 -0.51214
H  1.093732 -3.672539 -2.633211
H  0.107377 -2.520091 -3.517294
H  1.864844 -2.391895 -3.561969
H  1.507405 0.053341 -2.86322
H  -0.229057 -0.131871 -2.625585
H  0.78808 0.442106 -1.305021
H  2.475764 -4.02927 -0.869221
H  -3.237844 -2.043067 1.904753
H  -2.056943 -0.822711 2.390966
H  -2.345977 1.406744 1.669414
H  -4.324871 -1.734712 -0.456505
H  -5.460007 -0.05846 -1.869048
H  -5.016639 2.354146 -1.537477
H  -3.213525 5.555914 1.496445
H  -1.05758 2.383274 -0.416583
H  -1.080544 6.704329 1.980819
H  1.050458 3.518788 0.083287
H  1.067171 5.68466 1.282404
totalener: -1958.42657629 hartree
nucrepener: 2502.32185236 hartree
electener: -4460.74842865 hartree
oneelecener: -7657.82290446 hartree
twoeener: 3197.07447581 hartree
kineticenergy: 1952.61792987 hartree
xcener: -143.514242008690 hartree
chargesum: -0.0000000
charge: -0.041158 -0.048127 -0.264377 -0.394316 -0.298061 0.077876 0.041515 -0.089822 -0.245918 -0.247742 -0.206199 0.364360 0.052831 0.050640 -0.001734 -0.162532 -0.204758 0.256265 -0.078504 -0.217670 0.279341 -0.227239 -0.170447 -0.085875 -0.111068 -0.149106 0.087383 0.077815 0.071851 0.093490 0.098626 0.091975 0.092655 0.083063 0.095536 0.115771 0.105670 0.129810 0.112271 0.125015 0.125543 0.121747 0.124056 0.123190 0.122753 0.123604
qa: -0.0412 -0.0481 -0.2644 -0.3943 -0.2981 0.0779 0.0415 -0.0898 -0.2459 -0.2477 -0.2062 0.3644 0.0528 0.0506 -0.0017 -0.1625 -0.2048 0.2563 -0.0785 -0.2177 0.2793 -0.2272 -0.1704 -0.0859 -0.1111 -0.1491 0.0874 0.0778 0.0719 0.0935 0.0986 0.0920 0.0927 0.0831 0.0955 0.1158 0.1057 0.1298 0.1123 0.1250 0.1255 0.1217 0.1241 0.1232 0.1228 0.1236
va: 1.2861 1.2571 2.1368 2.1042 2.1203 3.7462 3.8239 3.8609 3.9098 3.9236 3.9248 4.2363 4.2465 3.8635 3.6531 3.9144 4.0197 3.8316 3.9196 4.0546 3.8128 4.0321 3.9357 3.9337 3.9525 3.9691 1.0502 1.0355 1.0098 1.0041 1.0029 1.0035 1.0007 1.0224 1.0305 0.9915 1.0105 1.0173 1.0143 0.9990 1.0130 1.0160 1.0030 0.9988 1.0003 1.0008
dispcorr: -0.023240862 hartree
energy: -1958.449817148655
dipole: -27.92148 27.24331 -0.67817 14.84417 -15.42570 -0.58154 -11.91981 11.35609 -0.56372
magnitude: 1.05635 au
magnitude: 2.68504 debye
