program: Orca
programVersion: 5.0.3
elementType: Cl Cl O O O C C C C C C C C C C C C C C C C C C C C C H H H H H H H H H H H H H H H H H H H H
charge: 0
multiplicity: 1
keywords: wb97x-d3
keywords: def2-TZVPP
keywords: def2/J RIJCOSX
keywords: DEFGRID2
keywords: scfconv7
keywords: smallprint printgap noloewdin
keywords: NOSOSCF
formula: C21H20Cl2O3
InChI: InChI=1/C21H20Cl2O3/c1-21(2)17(12-18(22)23)19(21)20(24)25-13-14-7-6-10-16(11-14)26-15-8-4-3-5-9-15/h3-12,17,19H,13H2,1-2H3
46 atoms
Cl 4.673016 -1.566418 0.796964
Cl 4.974917 -4.366338 0.168325
O  -1.722262 -1.914481 0.740249
O  -0.253511 -0.236523 0.933832
O  -3.299636 3.500938 -0.030355
C  0.947156 -1.598853 -1.615424
C  1.788713 -1.892828 -0.406233
C  0.30062 -2.161749 -0.366214
C  1.004372 -2.521347 -2.809658
C  0.74863 -0.152698 -2.001263
C  2.724448 -3.022709 -0.356461
C  -0.553349 -1.317739 0.501058
C  3.956146 -2.980766 0.136678
C  -2.709763 -1.15248 1.44281
C  -3.325369 -0.117887 0.544186
C  -3.023199 1.225499 0.712546
C  -4.170672 -0.512062 -0.488601
C  -3.546285 2.168546 -0.163594
C  -4.703624 0.436313 -1.345281
C  -4.388418 1.778009 -1.193872
C  -2.048061 3.957243 0.266396
C  -0.886397 3.298787 -0.118398
C  -1.976985 5.168137 0.942534
C  0.344038 3.858165 0.190989
C  -0.740104 5.720025 1.232875
C  0.427206 5.067071 0.864285
H  2.093914 -1.014333 0.15046
H  -0.015205 -3.196677 -0.439807
H  0.11294 -2.395537 -3.425781
H  1.872763 -2.291919 -3.429228
H  1.062816 -3.574535 -2.537104
H  0.805905 0.522739 -1.151401
H  1.520247 0.143086 -2.713841
H  -0.22032 -0.009618 -2.483503
H  2.394392 -3.979604 -0.741701
H  -3.450192 -1.888119 1.75543
H  -2.281972 -0.697201 2.337631
H  -2.358566 1.530077 1.510642
H  -4.41047 -1.559547 -0.623022
H  -5.364552 0.1321 -2.145974
H  -4.791308 2.52418 -1.865923
H  -0.930187 2.355298 -0.645715
H  -2.890796 5.669961 1.232356
H  1.245783 3.33708 -0.102586
H  -0.691099 6.664296 1.758957
H  1.391626 5.495856 1.099971
totalener: -1958.42622433 hartree
nucrepener: 2517.43521427 hartree
electener: -4475.86143860 hartree
oneelecener: -7688.03334679 hartree
twoeener: 3212.17190819 hartree
kineticenergy: 1952.62553027 hartree
xcener: -143.515501625537 hartree
chargesum: -0.0000000
charge: -0.041149 -0.048200 -0.262852 -0.391226 -0.299195 0.082622 0.042173 -0.085775 -0.247058 -0.249837 -0.207417 0.359200 0.052968 0.047052 -0.005846 -0.151554 -0.199276 0.244444 -0.082343 -0.213842 0.258187 -0.148306 -0.219183 -0.108897 -0.090173 -0.146897 0.087720 0.077529 0.093998 0.098671 0.071809 0.075049 0.093331 0.095315 0.095350 0.114864 0.107829 0.129965 0.112161 0.125639 0.125768 0.118246 0.122315 0.120109 0.123235 0.123477
qa: -0.0411 -0.0482 -0.2629 -0.3912 -0.2992 0.0826 0.0422 -0.0858 -0.2471 -0.2498 -0.2074 0.3592 0.0530 0.0471 -0.0058 -0.1516 -0.1993 0.2444 -0.0823 -0.2138 0.2582 -0.1483 -0.2192 -0.1089 -0.0902 -0.1469 0.0877 0.0775 0.0940 0.0987 0.0718 0.0750 0.0933 0.0953 0.0953 0.1149 0.1078 0.1300 0.1122 0.1256 0.1258 0.1182 0.1223 0.1201 0.1232 0.1235
va: 1.2862 1.2570 2.1360 2.1049 2.1182 3.7399 3.8232 3.8580 3.9107 3.9237 3.9257 4.2429 4.2461 3.8657 3.6488 3.9067 4.0181 3.8408 3.9228 4.0528 3.8463 3.9296 4.0259 3.9558 3.9382 3.9722 1.0492 1.0356 1.0039 1.0028 1.0098 1.0240 1.0047 0.9994 1.0305 0.9923 1.0093 1.0192 1.0136 0.9988 1.0128 1.0041 1.0155 1.0016 0.9987 1.0008
dispcorr: -0.023834644 hartree
energy: -1958.450058972712
dipole: -27.19311 26.49482 -0.69829 15.17879 -15.74152 -0.56273 -12.94251 12.34298 -0.59953
magnitude: 1.07876 au
magnitude: 2.74198 debye
