program: Orca
programVersion: 5.0.3
elementType: Cl Cl O O O C C C C C C C C C C C C C C C C C C C C C H H H H H H H H H H H H H H H H H H H H
charge: 0
multiplicity: 1
keywords: wb97x-d3
keywords: def2-TZVPP
keywords: def2/J RIJCOSX
keywords: DEFGRID2
keywords: scfconv7
keywords: smallprint printgap noloewdin
keywords: NOSOSCF
formula: C21H20Cl2O3
InChI: InChI=1/C21H20Cl2O3/c1-21(2)17(12-18(22)23)19(21)20(24)25-13-14-7-6-10-16(11-14)26-15-8-4-3-5-9-15/h3-12,17,19H,13H2,1-2H3
46 atoms
Cl 2.611797 -2.595853 -3.077412
Cl 5.085857 -3.720274 -2.104137
O  -0.296397 -0.010535 -1.338759
O  -1.137076 -2.057136 -1.002379
O  -2.478878 2.801961 2.450082
C  1.255002 -2.178952 1.034485
C  1.558277 -2.985933 -0.186682
C  1.108225 -1.55845 -0.345129
C  2.403506 -1.649298 1.859321
C  0.037808 -2.52852 1.855046
C  2.944568 -3.369505 -0.534563
C  -0.225894 -1.27815 -0.919356
C  3.474602 -3.242629 -1.743307
C  -1.572089 0.456597 -1.768778
C  -2.466837 0.760376 -0.59953
C  -2.038527 1.664945 0.367112
C  -3.705308 0.148779 -0.471686
C  -2.859644 1.964455 1.44444
C  -4.519215 0.454111 0.609437
C  -4.106331 1.363809 1.566839
C  -1.723539 3.906894 2.189304
C  -1.959736 4.727384 1.092679
C  -0.732523 4.227536 3.106209
C  -1.187757 5.864977 0.917039
C  0.024124 5.374635 2.923958
C  -0.1935 6.194247 1.826761
H  0.804275 -3.723566 -0.451505
H  1.870227 -0.831321 -0.601042
H  2.72857 -2.391612 2.591269
H  3.268124 -1.381098 1.251077
H  2.096735 -0.757973 2.408788
H  -0.760866 -2.966827 1.262333
H  0.312395 -3.247263 2.629265
H  -0.362559 -1.643435 2.352904
H  3.566704 -3.808069 0.237124
H  -1.357097 1.364011 -2.333941
H  -2.044556 -0.258914 -2.444042
H  -1.062996 2.128543 0.279432
H  -4.02585 -0.576938 -1.207434
H  -5.48476 -0.02345 0.709599
H  -4.735327 1.607281 2.412854
H  -2.741384 4.484931 0.384381
H  -0.565727 3.580654 3.957474
H  -1.372855 6.502811 0.062821
H  0.794313 5.622558 3.642414
H  0.40228 7.085468 1.684511
totalener: -1958.42448693 hartree
nucrepener: 2496.96116158 hartree
electener: -4455.38564850 hartree
oneelecener: -7647.22855883 hartree
twoeener: 3191.84291033 hartree
kineticenergy: 1952.63185711 hartree
xcener: -143.515015866249 hartree
chargesum: -0.0000000
charge: -0.033545 -0.044943 -0.266911 -0.378871 -0.300058 0.112041 -0.006843 -0.154141 -0.271700 -0.248856 -0.247458 0.365858 0.091264 0.062876 0.013190 -0.227902 -0.141198 0.251006 -0.085666 -0.215889 0.260073 -0.174789 -0.218823 -0.111678 -0.087123 -0.149399 0.105987 0.102000 0.091324 0.086680 0.096144 0.103356 0.083495 0.089509 0.117762 0.110982 0.102145 0.124733 0.110342 0.124850 0.126237 0.132051 0.124252 0.126811 0.125169 0.125655
qa: -0.0335 -0.0449 -0.2669 -0.3789 -0.3001 0.1120 -0.0068 -0.1541 -0.2717 -0.2489 -0.2475 0.3659 0.0913 0.0629 0.0132 -0.2279 -0.1412 0.2510 -0.0857 -0.2159 0.2601 -0.1748 -0.2188 -0.1117 -0.0871 -0.1494 0.1060 0.1020 0.0913 0.0867 0.0961 0.1034 0.0835 0.0895 0.1178 0.1110 0.1021 0.1247 0.1103 0.1248 0.1262 0.1321 0.1243 0.1268 0.1252 0.1257
va: 1.2978 1.2606 2.1189 2.1253 2.1094 3.7366 3.8328 3.8621 3.9124 3.9007 3.9086 4.2011 4.2019 3.8638 3.7049 3.9355 3.9903 3.8042 3.9393 4.0383 3.8045 3.9467 4.0433 3.9434 3.9315 3.9671 1.0285 1.0258 1.0019 1.0008 1.0061 1.0218 1.0026 1.0021 1.0170 0.9903 1.0121 1.0209 1.0157 0.9995 1.0125 1.0046 1.0145 0.9998 0.9987 1.0005
dispcorr: -0.022981735 hartree
energy: -1958.447468660067
dipole: -19.66109 19.72639 0.06530 17.81876 -17.21399 0.60477 24.29670 -23.82643 0.47027
magnitude: 0.76887 au
magnitude: 1.95432 debye
