program: Orca
programVersion: 5.0.3
elementType: Cl Cl O O O C C C C C C C C C C C C C C C C C C C C C H H H H H H H H H H H H H H H H H H H H
charge: 0
multiplicity: 1
keywords: wb97x-d3
keywords: def2-TZVPP
keywords: def2/J RIJCOSX
keywords: DEFGRID2
keywords: scfconv7
keywords: smallprint printgap noloewdin
keywords: NOSOSCF
formula: C21H20Cl2O3
InChI: InChI=1/C21H20Cl2O3/c1-21(2)17(12-18(22)23)19(21)20(24)25-13-14-7-6-10-16(11-14)26-15-8-4-3-5-9-15/h3-12,17,19H,13H2,1-2H3
46 atoms
Cl 0.95523 0.298275 -1.086218
Cl 3.829577 0.534854 -1.282499
O  -1.324278 -1.555023 1.583386
O  -1.538578 -2.828902 -0.24487
O  -1.254834 3.312729 -0.30378
C  1.380262 -3.769183 0.447703
C  1.409527 -2.651167 -0.537667
C  0.614792 -2.495052 0.742946
C  2.594448 -4.004463 1.315112
C  0.653793 -5.039596 0.07973
C  2.589675 -1.786981 -0.756728
C  -0.851583 -2.346284 0.61565
C  2.477177 -0.489399 -1.011702
C  -2.658023 -1.069054 1.427018
C  -2.707216 0.004989 0.377127
C  -1.972188 1.172395 0.574639
C  -3.429988 -0.171054 -0.791048
C  -1.967354 2.157832 -0.401025
C  -3.427234 0.826354 -1.757516
C  -2.701185 1.986963 -1.571751
C  -0.669169 3.639725 0.890328
C  0.69449 3.450601 1.050644
C  -1.434935 4.190619 1.907994
C  1.295952 3.826375 2.243231
C  -0.823798 4.55724 3.096932
C  0.541353 4.375673 3.268742
H  0.786597 -2.797148 -1.416655
H  1.060762 -1.8594 1.499031
H  3.094801 -3.077598 1.597812
H  2.312805 -4.518329 2.235228
H  3.322202 -4.632587 0.797311
H  0.289749 -5.548022 0.97415
H  -0.196679 -4.864349 -0.573684
H  1.336887 -5.720603 -0.430957
H  3.583642 -2.217584 -0.732538
H  -3.348247 -1.881262 1.192282
H  -2.921757 -0.669972 2.406749
H  -1.396669 1.295049 1.483803
H  -3.976264 -1.09003 -0.955561
H  -3.98954 0.692456 -2.6720
H  -2.689157 2.763588 -2.325192
H  1.275723 3.01593 0.248201
H  -2.497979 4.335732 1.763849
H  2.361082 3.684489 2.369573
H  -1.417619 4.990726 3.890704
H  1.015192 4.66683 4.196567
totalener: -1958.42329788 hartree
nucrepener: 2665.01407611 hartree
electener: -4623.43737399 hartree
oneelecener: -7983.67080026 hartree
twoeener: 3360.23342627 hartree
kineticenergy: 1952.63402096 hartree
xcener: -143.515928937129 hartree
chargesum: 0.0000000
charge: -0.028475 -0.049538 -0.264277 -0.385542 -0.288584 0.128987 -0.034421 -0.118220 -0.273139 -0.251583 -0.241136 0.343355 0.098046 0.064454 0.008680 -0.251678 -0.131268 0.227705 -0.084568 -0.195480 0.203390 -0.138935 -0.139372 -0.136390 -0.130812 -0.113188 0.114496 0.096984 0.083548 0.094749 0.094170 0.085486 0.103900 0.082768 0.118813 0.099445 0.111572 0.115226 0.109380 0.122939 0.123673 0.117359 0.127607 0.126306 0.127057 0.126510
qa: -0.0285 -0.0495 -0.2643 -0.3855 -0.2886 0.1290 -0.0344 -0.1182 -0.2731 -0.2516 -0.2411 0.3434 0.0980 0.0645 0.0087 -0.2517 -0.1313 0.2277 -0.0846 -0.1955 0.2034 -0.1389 -0.1394 -0.1364 -0.1308 -0.1132 0.1145 0.0970 0.0835 0.0947 0.0942 0.0855 0.1039 0.0828 0.1188 0.0994 0.1116 0.1152 0.1094 0.1229 0.1237 0.1174 0.1276 0.1263 0.1271 0.1265
va: 1.3257 1.2575 2.1185 2.1117 2.1035 3.7260 3.8572 3.8446 3.9123 3.8956 3.9224 4.2210 4.1837 3.8598 3.7112 3.8967 3.9862 3.7614 3.9578 4.0301 3.8498 3.9870 3.9846 3.9759 3.9444 3.9361 1.0275 1.0277 1.0012 1.0066 1.0007 1.0024 1.0234 1.0020 1.0150 1.0124 0.9917 1.0304 1.0185 0.9991 1.0141 1.0337 1.0065 1.0009 0.9999 0.9996
dispcorr: -0.026300543 hartree
energy: -1958.449598420701
dipole: -8.39381 8.73538 0.34157 -16.83966 16.45574 -0.38392 14.36619 -13.49253 0.87366
magnitude: 1.01358 au
magnitude: 2.57631 debye
