program: Gaussian 09
title: 000074859
version: EM64L-G09RevD.01
frameworkgroup: C1[X(C5H6N2)]
method: RPBEPBE
basis: SDD
operation: Freq
keyword: #p
keyword: freq=noraman
keyword: PBEPBE/SDD
title: #p freq=noraman PBEPBE/SDD
converged: NO YES NO NO
title: Mulliken charges:
elementType: N N C C C C C H H H H H H
charge: -0.003186 -0.003192 0.385012 -0.783747 -0.362250 -0.362043 -0.340126 0.233334 0.233269 0.245428 0.252233 0.252231 0.253036
chargesum: 0.00000
title: Mulliken charges with hydrogens summed into heavy atoms:
elementType: N N C C C C C
charge: -0.003186 -0.003192 0.385012 -0.071717 -0.110017 -0.109811 -0.087089
polarizability: 8.23942465e+01 -5.76384854e-03 6.67406690e+01 3.21994433e-01 1.71177360e-04 3.28058091e+01
1716.lowfreq: -16.2167 -14.6673 -0.0003 0.0002 0.0005 13.9863 18.0675 188.9622 317.3645
frequency: 15.0557 188.9564 317.3635 396.7669 420.3086 545.3728 615.9162 739.2684 788.1018 870.2613 949.9543 953.6559 984.9122 1012.5931 1052.2752 1087.3862 1155.6188 1228.7684 1244.2136 1345.4166 1398.6662 1401.5661 1403.6398 1463.5703 1471.2484 1521.0100 1555.5540 2981.8479 3066.0307 3087.9888 3118.6624 3123.3788 3168.6397
redmass: 1.0386 2.7138 2.6581 4.1024 2.9385 4.9930 9.0688 2.1389 8.1393 1.5926 1.3806 1.4805 1.4322 4.2050 1.5912 5.5221 2.2657 10.3858 2.1449 1.2137 2.7633 1.2198 1.5225 1.1926 1.0534 3.5484 4.7425 1.0375 1.0968 1.0998 1.0922 1.0932 1.0931
irintensity: 0.7357 0.7588 0.0297 0.0092 0.0434 0.1129 9.3994 26.9058 3.5420 13.3743 0.0082 0.9204 3.8425 0.3998 16.5885 1.4892 18.7669 0.7138 4.7593 1.1091 62.7530 14.5077 6.9271 4.4169 14.4625 44.1414 0.0842 19.3393 17.4874 13.3723 21.1893 23.2685 14.4653
temp: 298.150 k
press: 1.00000 atm
elementType: 7 7 6 6 6 6 6 1 1 1 1 1 1
symmnumber: 1
zpe: 267209.7 jmol-1
zpe.correction: 0.101775 hartree
zpe.thermalcorrener: 0.108001 hartree
zpe.thermalcorrenthalpy: 0.108945 hartree
zpe.thermalcorrgfe: 0.070224 hartree
zpe.sumelectzpe: -303.109040 hartree
zpe.sumelectthermal: -303.102814 hartree
zpe.sumelectthermalent: -303.101870 hartree
zpe.sumelectthermalfe: -303.140590 hartree
dipole: 3.4272 -0.0006 0.0591
dipole: 3.4277
quadrupole: -38.4667 -44.8283 -42.3515
quadrupole: -0.0011 0.0808 0.0001
quadrupole: 3.4155 -2.9461 -0.4693 -0.0011 0.0808 0.0001
hfenergy: -303.2108146 hartree
pointgroup: C01 [X(C5H6N2)]
dipole: -1.3483863 -0.0003044 -0.0212841 debye
dipolederiv: -0.499276 -0.0020826 0.0048716 0.0963046 -0.3900969 0.0039259 0.0052538 -0.0004061 -0.2047049 -0.4994146 0.0021266 0.0048709 -0.0963428 -0.3901352 -0.0039319 0.0052504 0.0004007 -0.2046864 0.3399966 0.000278 0.025857 0.000369 -0.3952957 0.0000091 0.0531587 0.0000082 0.0803434 -0.1769699 -0.0002416 -0.0184811 -0.0008624 0.078685 -0.0000089 -0.1044866 -0.0000365 0.0475167 0.1327863 0.0465638 -0.001494 -0.1973935 0.3928782 -0.0055106 -0.0073393 -0.0050659 -0.0587382 0.1328459 -0.0465745 -0.0014712 0.1972205 0.3930824 0.0055202 -0.0073451 0.0050858 -0.0587795 0.5568271 0.0000022 -0.0101111 0.0001159 0.2741639 0.0000031 -0.0108288 -0.000001 -0.0236298 0.0315694 -0.0204345 0.0215567 -0.0906769 -0.0525241 0.1007922 0.0698413 0.0765451 0.0685812 0.0317452 0.0204435 0.0213279 0.0913701 -0.0536409 -0.1001076 0.0693143 -0.0759637 0.0695019 -0.0004911 -0.0001142 -0.0552178 -0.0001212 0.1245821 -0.0006927 -0.0869672 -0.0005646 -0.0813331 0.0206123 0.0971966 0.0031048 0.104587 -0.0343717 0.0003214 0.006097 -0.0053043 0.1164811 0.0206971 -0.09716 0.0030915 -0.104578 -0.0344072 -0.0003198 0.006095 0.0053014 0.11642 -0.0909281 -0.0000034 0.0020947 0.0000076 0.08708 -0.0000005 0.0019564 0.0000008 0.1330277 unknown
polarizability: 82.3950823|0.0064199|66.7406695|0.2494168|-0.0003072|32.8049728 unknown
InChI: InChI=1S/C5H6N2/c1-5-2-6-4-7-3-5/h2-4H,1H3
charge 0 multiplicity 1
13 atoms
N  1.139324 1.21904 -0.001174
N  1.139342 -1.218996 -0.001167
C  -0.986978 0.000012 0.009535
C  -2.499963 -0.000098 -0.001584
C  -0.227927 1.19968 0.008699
C  -0.22786 -1.199679 0.008708
C  1.755285 0.000046 -0.007813
H  -2.906222 -0.891978 0.507227
H  -2.906308 0.894633 0.502109
H  -2.889457 -0.003105 -1.037211
H  -0.721016 2.179837 0.018331
H  -0.720949 -2.17984 0.01836
H  2.849031 0.000048 -0.018321
