program: Orca
programVersion: 5.0.3
elementType: Cl Cl O O O C C C C C C C C C C C C C C C C C C C C C H H H H H H H H H H H H H H H H H H H H
charge: 0
multiplicity: 1
keywords: wb97x-d3
keywords: def2-TZVPP
keywords: def2/J RIJCOSX
keywords: DEFGRID2
keywords: scfconv7
keywords: smallprint printgap noloewdin
keywords: NOSOSCF
formula: C21H20Cl2O3
InChI: InChI=1/C21H20Cl2O3/c1-21(2)17(12-18(22)23)19(21)20(24)25-13-14-7-6-10-16(11-14)26-15-8-4-3-5-9-15/h3-12,17,19H,13H2,1-2H3
46 atoms
Cl 2.419315 -2.024755 -3.865952
Cl 4.833269 -1.008343 -2.657531
O  -0.873988 -1.419784 1.522462
O  -1.357023 -2.495376 -0.378836
O  -1.789556 3.676919 0.379863
C  1.440572 -3.804948 0.114652
C  1.56935 -2.711538 -0.90711
C  0.897456 -2.425431 0.421361
C  2.651352 -4.233387 0.910279
C  0.511525 -4.95307 -0.197296
C  2.857059 -2.074493 -1.208453
C  -0.555399 -2.134863 0.440593
C  3.299238 -1.749981 -2.417495
C  -2.24296 -1.038537 1.669677
C  -2.605546 0.123272 0.789045
C  -2.023216 1.364151 1.024569
C  -3.506974 -0.029067 -0.255402
C  -2.359276 2.448215 0.226473
C  -3.835714 1.059901 -1.048495
C  -3.270323 2.300975 -0.8111
C  -1.513034 4.160653 1.624507
C  -2.390332 4.01328 2.692747
C  -0.331265 4.870936 1.779541
C  -2.068116 4.573987 3.918715
C  -0.027503 5.435447 3.008504
C  -0.888835 5.285421 4.084914
H  0.882526 -2.793353 -1.741754
H  1.473584 -1.855127 1.141477
H  3.268285 -4.921422 0.330041
H  3.283095 -3.400616 1.217123
H  2.339717 -4.751742 1.818239
H  1.065875 -5.738628 -0.713229
H  0.107986 -5.383948 0.721051
H  -0.324627 -4.664519 -0.828137
H  3.516221 -1.841111 -0.381465
H  -2.901686 -1.88805 1.480647
H  -2.335805 -0.765519 2.721087
H  -1.307543 1.481497 1.8299
H  -3.939162 -1.000138 -0.455841
H  -4.538068 0.941859 -1.862789
H  -3.522015 3.155396 -1.425348
H  -3.318742 3.470564 2.569905
H  0.337708 4.981081 0.936235
H  -2.753057 4.459003 4.748527
H  0.893772 5.991034 3.123784
H  -0.646021 5.722337 5.043893
totalener: -1958.42628191 hartree
nucrepener: 2450.87714595 hartree
electener: -4409.30342786 hartree
oneelecener: -7555.05309221 hartree
twoeener: 3145.74966435 hartree
kineticenergy: 1952.62127501 hartree
xcener: -143.513459696427 hartree
chargesum: -0.0000000
charge: -0.040629 -0.049799 -0.269482 -0.389340 -0.300316 0.067229 0.045105 -0.091101 -0.245539 -0.249580 -0.201490 0.367837 0.050771 0.055694 -0.002046 -0.207185 -0.121373 0.233056 -0.095939 -0.203450 0.251296 -0.171166 -0.212532 -0.113201 -0.088728 -0.149835 0.086902 0.074909 0.098189 0.072322 0.092901 0.087625 0.083932 0.104359 0.094205 0.101833 0.114061 0.121736 0.112332 0.124724 0.126760 0.131545 0.126353 0.126637 0.125318 0.125100
qa: -0.0406 -0.0498 -0.2695 -0.3893 -0.3003 0.0672 0.0451 -0.0911 -0.2455 -0.2496 -0.2015 0.3678 0.0508 0.0557 -0.0020 -0.2072 -0.1214 0.2331 -0.0959 -0.2034 0.2513 -0.1712 -0.2125 -0.1132 -0.0887 -0.1498 0.0869 0.0749 0.0982 0.0723 0.0929 0.0876 0.0839 0.1044 0.0942 0.1018 0.1141 0.1217 0.1123 0.1247 0.1268 0.1315 0.1264 0.1266 0.1253 0.1251
va: 1.2869 1.2551 2.1287 2.1143 2.1096 3.7536 3.8244 3.8565 3.9109 3.9135 3.9234 4.2273 4.2448 3.8657 3.6861 3.9523 3.9681 3.8315 3.9522 4.0326 3.8115 3.9426 4.0391 3.9439 3.9309 3.9654 1.0493 1.0368 1.0029 1.0101 1.0040 1.0012 1.0020 1.0235 1.0314 1.0113 0.9912 1.0172 1.0200 0.9997 1.0120 1.0047 1.0140 0.9998 0.9988 1.0006
dispcorr: -0.021350869 hartree
energy: -1958.447632778795
dipole: -18.16343 18.03647 -0.12695 -4.42340 4.15249 -0.27091 27.63232 -26.31789 1.31442
magnitude: 1.34804 au
magnitude: 3.42645 debye
