program: Orca
programVersion: 5.0.3
elementType: Cl Cl O O O C C C C C C C C C C C C C C C C C C C C C H H H H H H H H H H H H H H H H H H H H
charge: 0
multiplicity: 1
keywords: wb97x-d3
keywords: def2-TZVPP
keywords: def2/J RIJCOSX
keywords: DEFGRID2
keywords: scfconv7
keywords: smallprint printgap noloewdin
keywords: NOSOSCF
formula: C21H20Cl2O3
InChI: InChI=1/C21H20Cl2O3/c1-21(2)17(12-18(22)23)19(21)20(24)25-13-14-7-6-10-16(11-14)26-15-8-4-3-5-9-15/h3-12,17,19H,13H2,1-2H3
46 atoms
Cl 1.551626 0.017116 0.456168
Cl 3.54155 -0.85299 2.364199
O  -1.955791 -2.605457 -0.487099
O  -0.709041 -2.233945 -2.314712
O  -0.455374 2.382398 -0.443544
C  1.299958 -4.244961 -1.000054
C  1.65792 -2.842676 -0.643877
C  0.236181 -3.338729 -0.417663
C  1.747697 -5.366201 -0.091734
C  1.276976 -4.635305 -2.457892
C  2.502352 -2.484785 0.5124
C  -0.830965 -2.682219 -1.203975
C  2.528622 -1.266005 1.038073
C  -2.980268 -1.707316 -0.926763
C  -2.784446 -0.377441 -0.254356
C  -1.788823 0.484794 -0.699638
C  -3.537834 -0.030433 0.860032
C  -1.522101 1.656283 -0.008473
C  -3.284408 1.158407 1.527537
C  -2.271271 2.005273 1.10941
C  -0.438184 3.742664 -0.344162
C  0.758976 4.333506 0.033481
C  -1.54046 4.524452 -0.667507
C  0.853797 5.715665 0.079704
C  -1.434018 5.905239 -0.605967
C  -0.240488 6.507525 -0.23506
H  1.738681 -2.1650 -1.489055
H  -0.034226 -3.547582 0.610632
H  1.109207 -6.240341 -0.225584
H  2.77112 -5.667177 -0.324748
H  1.710044 -5.096623 0.964052
H  1.004287 -3.810896 -3.11104
H  2.264671 -4.990539 -2.757063
H  0.568836 -5.447597 -2.629418
H  3.14952 -3.23334 0.95299
H  -2.978361 -1.617986 -2.01337
H  -3.92231 -2.160846 -0.62006
H  -1.195465 0.24238 -1.572013
H  -4.315464 -0.694482 1.21609
H  -3.869073 1.422872 2.398625
H  -2.061995 2.916048 1.655161
H  1.606583 3.707251 0.279843
H  -2.470535 4.062567 -0.973006
H  1.790162 6.17434 0.368771
H  -2.291834 6.513539 -0.86082
H  -0.163609 7.585532 -0.195004
totalener: -1958.42357353 hartree
nucrepener: 2592.77527864 hartree
electener: -4551.19885217 hartree
oneelecener: -7839.16651899 hartree
twoeener: 3287.96766682 hartree
kineticenergy: 1952.61570201 hartree
xcener: -143.512844541540 hartree
chargesum: 0.0000000
charge: -0.030108 -0.048785 -0.263718 -0.395690 -0.302148 0.132266 -0.076814 -0.067426 -0.277541 -0.246818 -0.201760 0.339241 0.071946 0.049238 0.051895 -0.249462 -0.186719 0.243186 -0.095690 -0.184167 0.257301 -0.206046 -0.174619 -0.095541 -0.117572 -0.143122 0.110839 0.087143 0.094815 0.097124 0.077979 0.103884 0.083217 0.085687 0.115772 0.119144 0.095023 0.148392 0.105958 0.125680 0.135565 0.122068 0.133099 0.126040 0.126190 0.125053
qa: -0.0301 -0.0488 -0.2637 -0.3957 -0.3021 0.1323 -0.0768 -0.0674 -0.2775 -0.2468 -0.2018 0.3392 0.0719 0.0492 0.0519 -0.2495 -0.1867 0.2432 -0.0957 -0.1842 0.2573 -0.2060 -0.1746 -0.0955 -0.1176 -0.1431 0.1108 0.0871 0.0948 0.0971 0.0780 0.1039 0.0832 0.0857 0.1158 0.1191 0.0950 0.1484 0.1060 0.1257 0.1356 0.1221 0.1331 0.1260 0.1262 0.1251
va: 1.3281 1.2585 2.1274 2.0961 2.0778 3.7454 3.8966 3.8211 3.9150 3.8909 3.8612 4.2272 4.2239 3.8514 3.7019 3.9666 4.0378 3.7710 3.9585 3.9930 3.8017 4.0294 3.9600 3.9441 3.9518 3.9583 1.0298 1.0326 1.0062 0.9997 1.0028 1.0225 1.0018 1.0025 1.0182 1.0144 0.9991 1.0304 1.0122 1.0003 1.0032 1.0191 1.0051 0.9993 1.0000 1.0004
dispcorr: -0.024377622 hartree
energy: -1958.447951146818
dipole: -12.43203 12.02660 -0.40543 -10.36919 9.99647 -0.37272 -11.10283 11.55888 0.45605
magnitude: 0.71504 au
magnitude: 1.81748 debye
