program: Orca
programVersion: 5.0.3
elementType: Cl Cl O O O C C C C C C C C C C C C C C C C C C C C C H H H H H H H H H H H H H H H H H H H H
charge: 0
multiplicity: 1
keywords: wb97x-d3
keywords: def2-TZVPP
keywords: def2/J RIJCOSX
keywords: DEFGRID2
keywords: scfconv7
keywords: smallprint printgap noloewdin
keywords: NOSOSCF
formula: C21H20Cl2O3
InChI: InChI=1/C21H20Cl2O3/c1-21(2)17(12-18(22)23)19(21)20(24)25-13-14-7-6-10-16(11-14)26-15-8-4-3-5-9-15/h3-12,17,19H,13H2,1-2H3
46 atoms
Cl 4.105743 -3.052208 1.387919
Cl 5.02422 -4.039333 -1.163616
O  -1.737877 -1.388519 -1.124088
O  -0.836866 -1.466619 0.929324
O  -2.777478 3.491638 -0.219466
C  1.565648 -0.224014 -0.737952
C  1.861314 -1.624895 -0.278012
C  0.570008 -1.33652 -1.003951
C  2.282199 0.332615 -1.945025
C  1.286259 0.819292 0.315554
C  2.883535 -2.45322 -0.932496
C  -0.710695 -1.410762 -0.262994
C  3.868601 -3.091178 -0.312447
C  -3.055094 -1.423154 -0.602984
C  -3.653506 -0.054533 -0.405906
C  -2.889007 1.101062 -0.401661
C  -5.029901 0.037198 -0.212325
C  -3.497887 2.332611 -0.186237
C  -5.627642 1.26841 -0.01188
C  -4.864714 2.426762 0.011213
C  -1.636323 3.60318 0.518058
C  -1.472584 2.979926 1.74969
C  -0.638049 4.423613 0.008228
C  -0.303869 3.18878 2.465731
C  0.520968 4.628416 0.739885
C  0.696748 4.010502 1.969261
H  1.750674 -1.779338 0.78932
H  0.503877 -1.651324 -2.039897
H  3.265695 0.712094 -1.663515
H  2.427048 -0.401544 -2.736839
H  1.714835 1.161992 -2.369671
H  2.221175 1.289152 0.624348
H  0.6425 1.610957 -0.073694
H  0.813474 0.411616 1.205534
H  2.845116 -2.559737 -2.009723
H  -3.644966 -1.978562 -1.333591
H  -3.082327 -1.975931 0.339058
H  -1.821369 1.06649 -0.574831
H  -5.638382 -0.859448 -0.224845
H  -6.698031 1.330908 0.13285
H  -5.320217 3.394837 0.170849
H  -2.246347 2.339095 2.151833
H  -0.781931 4.902637 -0.951444
H  -0.180203 2.70234 3.424297
H  1.293794 5.272009 0.340506
H  1.603818 4.168884 2.53656
totalener: -1958.42599816 hartree
nucrepener: 2543.15156210 hartree
electener: -4501.57756026 hartree
oneelecener: -7739.27698337 hartree
twoeener: 3237.69942311 hartree
kineticenergy: 1952.60601376 hartree
xcener: -143.515344265260 hartree
chargesum: -0.0000000
charge: -0.041392 -0.048328 -0.267690 -0.360761 -0.298474 0.109145 0.043804 -0.091940 -0.240178 -0.263948 -0.201904 0.295023 0.046259 0.047210 0.046188 -0.145472 -0.188441 0.203086 -0.094253 -0.194105 0.213834 -0.125166 -0.191031 -0.137337 -0.096403 -0.150266 0.088153 0.076717 0.098043 0.071824 0.096646 0.097100 0.056559 0.108391 0.097635 0.110974 0.116483 0.121357 0.108354 0.125415 0.126777 0.130312 0.123835 0.129251 0.124149 0.124562
qa: -0.0414 -0.0483 -0.2677 -0.3608 -0.2985 0.1091 0.0438 -0.0919 -0.2402 -0.2639 -0.2019 0.2950 0.0463 0.0472 0.0462 -0.1455 -0.1884 0.2031 -0.0943 -0.1941 0.2138 -0.1252 -0.1910 -0.1373 -0.0964 -0.1503 0.0882 0.0767 0.0980 0.0718 0.0966 0.0971 0.0566 0.1084 0.0976 0.1110 0.1165 0.1214 0.1084 0.1254 0.1268 0.1303 0.1238 0.1293 0.1241 0.1246
va: 1.2860 1.2572 2.1288 2.1357 2.1065 3.7614 3.8266 3.8832 3.9019 3.9020 3.9110 4.2890 4.2403 3.8796 3.6990 3.9654 4.0018 3.8688 3.9477 4.0319 3.8137 3.8720 3.9813 3.9073 3.9215 3.9097 1.0501 1.0377 1.0038 1.0100 1.0034 1.0056 1.0099 1.0145 1.0278 0.9894 1.0087 0.9971 1.0096 0.9997 1.0116 1.0068 1.0147 1.0006 0.9991 1.0014
dispcorr: -0.025538216 hartree
energy: -1958.451536375072
dipole: -22.57517 22.04891 -0.52626 26.97713 -26.61876 0.35837 -2.63021 2.05679 -0.57341
magnitude: 0.85685 au
magnitude: 2.17793 debye
