program: Orca
programVersion: 5.0.3
elementType: Cl Cl O O O C C C C C C C C C C C C C C C C C C C C C H H H H H H H H H H H H H H H H H H H H
charge: 0
multiplicity: 1
keywords: wb97x-d3
keywords: def2-TZVPP
keywords: def2/J RIJCOSX
keywords: DEFGRID2
keywords: scfconv7
keywords: smallprint printgap noloewdin
keywords: NOSOSCF
formula: C21H20Cl2O3
InChI: InChI=1/C21H20Cl2O3/c1-21(2)17(12-18(22)23)19(21)20(24)25-13-14-7-6-10-16(11-14)26-15-8-4-3-5-9-15/h3-12,17,19H,13H2,1-2H3
46 atoms
Cl 2.612595 0.8892 0.489331
Cl 4.986887 -0.618313 1.145897
O  -1.416905 -1.883617 0.275669
O  -1.358788 -3.932297 1.162241
O  -2.220937 2.857141 -1.09006
C  1.003375 -2.867613 -1.363933
C  1.394707 -1.897416 -0.286008
C  0.574808 -3.123262 0.065134
C  2.033678 -3.820116 -1.924473
C  0.015684 -2.40508 -2.408447
C  2.76931 -1.785566 0.216935
C  -0.820651 -3.043586 0.560126
C  3.366269 -0.652671 0.568183
C  -2.760936 -1.713146 0.699633
C  -3.292231 -0.422837 0.143011
C  -2.452843 0.63217 -0.192608
C  -4.667385 -0.281743 -0.007013
C  -2.9954 1.815312 -0.680119
C  -5.196896 0.905051 -0.486584
C  -4.367431 1.960464 -0.825602
C  -1.051526 3.14783 -0.44901
C  -0.969168 3.217119 0.936655
C  0.052259 3.440572 -1.235899
C  0.229992 3.582888 1.526928
C  1.242544 3.817431 -0.632553
C  1.338359 3.888105 0.749312
H  0.842346 -0.966243 -0.300344
H  1.107611 -3.931801 0.553003
H  2.651222 -3.319517 -2.672014
H  2.698783 -4.230286 -1.165538
H  1.541179 -4.664178 -2.409175
H  0.55667 -1.991066 -3.260804
H  -0.581539 -3.242453 -2.774033
H  -0.665881 -1.63763 -2.051289
H  3.353276 -2.691408 0.323076
H  -3.377124 -2.551575 0.365671
H  -2.801837 -1.703157 1.793478
H  -1.380278 0.537222 -0.08531
H  -5.326793 -1.103415 0.244429
H  -6.267368 1.008977 -0.603559
H  -4.770475 2.888241 -1.209172
H  -1.833936 2.995332 1.548867
H  -0.030387 3.380938 -2.313109
H  0.294301 3.637581 2.605534
H  2.10104 4.049588 -1.248555
H  2.268842 4.178889 1.217576
totalener: -1958.42401447 hartree
nucrepener: 2605.62807157 hartree
electener: -4564.05208604 hartree
oneelecener: -7864.08141525 hartree
twoeener: 3300.02932921 hartree
kineticenergy: 1952.61857676 hartree
xcener: -143.517357203453 hartree
chargesum: 0.0000000
charge: -0.041603 -0.052229 -0.277491 -0.352610 -0.297668 0.069968 0.089411 -0.073968 -0.251123 -0.240621 -0.224027 0.319735 0.061079 0.052567 0.057200 -0.199721 -0.202778 0.234906 -0.090892 -0.211662 0.246179 -0.166884 -0.201434 -0.062768 -0.085839 -0.225698 0.060805 0.080321 0.097736 0.073516 0.093945 0.087444 0.093005 0.084765 0.093837 0.100328 0.110905 0.138231 0.110185 0.125112 0.125744 0.130202 0.125444 0.128567 0.129380 0.138498
qa: -0.0416 -0.0522 -0.2775 -0.3526 -0.2977 0.0700 0.0894 -0.0740 -0.2511 -0.2406 -0.2240 0.3197 0.0611 0.0526 0.0572 -0.1997 -0.2028 0.2349 -0.0909 -0.2117 0.2462 -0.1669 -0.2014 -0.0628 -0.0858 -0.2257 0.0608 0.0803 0.0977 0.0735 0.0939 0.0874 0.0930 0.0848 0.0938 0.1003 0.1109 0.1382 0.1102 0.1251 0.1257 0.1302 0.1254 0.1286 0.1294 0.1385
va: 1.3034 1.2546 2.1085 2.1558 2.1124 3.7451 3.7977 3.8492 3.9186 3.9204 3.9446 4.2863 4.2450 3.8431 3.7212 3.9110 4.0255 3.8294 3.9570 4.0357 3.8060 3.9565 4.0246 3.8810 3.8525 3.9049 1.0178 1.0327 1.0017 1.0109 1.0037 1.0032 1.0020 1.0154 1.0314 1.0044 0.9927 1.0109 1.0106 0.9994 1.0132 1.0046 1.0126 0.9981 0.9996 1.0010
dispcorr: -0.024832912 hartree
energy: -1958.448847377507
dipole: -19.50494 19.38203 -0.12291 -9.41608 9.49096 0.07488 -12.57891 12.07147 -0.50744
magnitude: 0.52746 au
magnitude: 1.34069 debye
