program: Orca
programVersion: 5.0.3
elementType: Cl Cl O O O C C C C C C C C C C C C C C C C C C C C C H H H H H H H H H H H H H H H H H H H H
charge: 0
multiplicity: 1
keywords: wb97x-d3
keywords: def2-TZVPP
keywords: def2/J RIJCOSX
keywords: DEFGRID2
keywords: scfconv7
keywords: smallprint printgap noloewdin
keywords: NOSOSCF
formula: C21H20Cl2O3
InChI: InChI=1/C21H20Cl2O3/c1-21(2)17(12-18(22)23)19(21)20(24)25-13-14-7-6-10-16(11-14)26-15-8-4-3-5-9-15/h3-12,17,19H,13H2,1-2H3
46 atoms
Cl 2.194128 -5.91373 -2.001026
Cl 4.696077 -4.881926 -3.00217
O  -0.259726 -0.135966 -1.44284
O  -0.962188 -2.095349 -0.611279
O  -2.300027 4.524733 0.549084
C  1.934582 -2.249223 0.529951
C  1.848515 -3.048203 -0.737529
C  1.374546 -1.607125 -0.721181
C  3.276582 -1.73384 0.993989
C  1.032195 -2.64101 1.674895
C  3.036332 -3.399863 -1.524289
C  -0.072033 -1.337809 -0.897305
C  3.267304 -4.576137 -2.0943
C  -1.603941 0.295913 -1.683213
C  -2.149364 1.066055 -0.514814
C  -1.970282 2.441707 -0.461067
C  -2.816888 0.420521 0.521859
C  -2.464805 3.17457 0.609307
C  -3.301154 1.158573 1.589559
C  -3.135181 2.534514 1.643899
C  -2.254233 5.26077 1.69922
C  -3.103255 6.351402 1.806017
C  -1.347566 4.969008 2.71088
C  -3.038796 7.160057 2.931461
C  -1.300098 5.77873 3.834433
C  -2.14287 6.875552 3.950577
H  1.046485 -3.777092 -0.754229
H  2.024075 -0.878341 -1.193035
H  3.905681 -1.374441 0.180451
H  3.141089 -0.90273 1.687481
H  3.827426 -2.517749 1.516084
H  1.54517 -3.366469 2.308409
H  0.793424 -1.772826 2.291978
H  0.09711 -3.085811 1.346745
H  3.798224 -2.643373 -1.666493
H  -1.540085 0.935008 -2.563573
H  -2.24143 -0.555147 -1.92468
H  -1.452693 2.961085 -1.258814
H  -2.956311 -0.651416 0.490669
H  -3.8282 0.659867 2.392224
H  -3.534764 3.097341 2.477227
H  -3.801241 6.564791 1.007173
H  -0.682028 4.12028 2.618272
H  -3.698717 8.013687 3.011883
H  -0.59269 5.552629 4.621294
H  -2.097385 7.506051 4.828098
totalener: -1958.42694825 hartree
nucrepener: 2380.62949640 hartree
electener: -4339.05644465 hartree
oneelecener: -7414.34637279 hartree
twoeener: 3075.28992814 hartree
kineticenergy: 1952.61416301 hartree
xcener: -143.511915979073 hartree
chargesum: -0.0000000
charge: -0.041032 -0.049137 -0.261688 -0.399466 -0.297602 0.070764 0.039920 -0.087988 -0.245244 -0.249909 -0.201831 0.369303 0.050314 0.046653 0.004057 -0.227276 -0.142720 0.223825 -0.125785 -0.153281 0.221232 -0.189816 -0.156335 -0.101356 -0.115870 -0.135046 0.086596 0.076910 0.071965 0.093581 0.097658 0.087296 0.086041 0.102997 0.094955 0.101424 0.115057 0.108657 0.134964 0.127337 0.131788 0.125511 0.132877 0.126138 0.127201 0.126364
qa: -0.0410 -0.0491 -0.2617 -0.3995 -0.2976 0.0708 0.0399 -0.0880 -0.2452 -0.2499 -0.2018 0.3693 0.0503 0.0467 0.0041 -0.2273 -0.1427 0.2238 -0.1258 -0.1533 0.2212 -0.1898 -0.1563 -0.1014 -0.1159 -0.1350 0.0866 0.0769 0.0720 0.0936 0.0977 0.0873 0.0860 0.1030 0.0950 0.1014 0.1151 0.1087 0.1350 0.1273 0.1318 0.1255 0.1329 0.1261 0.1272 0.1264
va: 1.2864 1.2560 2.1423 2.0994 2.1032 3.7511 3.8226 3.8753 3.9092 3.9130 3.9190 4.2195 4.2456 3.8492 3.7145 4.0936 3.9431 3.8726 3.9758 3.9265 3.8261 4.0336 3.9624 3.9355 3.9430 3.9527 1.0498 1.0358 1.0102 1.0040 1.0029 1.0009 1.0023 1.0235 1.0311 0.9984 1.0112 1.0244 1.0209 1.0014 1.0055 1.0128 1.0033 0.9991 0.9998 1.0001
dispcorr: -0.021130100 hartree
energy: -1958.448078351003
dipole: -15.25580 15.31790 0.06210 31.50923 -30.42258 1.08664 26.34715 -25.52417 0.82298
magnitude: 1.36453 au
magnitude: 3.46836 debye
