program: Orca
programVersion: 5.0.3
elementType: Cl Cl O O O C C C C C C C C C C C C C C C C C C C C C H H H H H H H H H H H H H H H H H H H H
charge: 0
multiplicity: 1
keywords: wb97x-d3
keywords: def2-TZVPP
keywords: def2/J RIJCOSX
keywords: DEFGRID2
keywords: scfconv7
keywords: smallprint printgap noloewdin
keywords: NOSOSCF
formula: C21H20Cl2O3
InChI: InChI=1/C21H20Cl2O3/c1-21(2)17(12-18(22)23)19(21)20(24)25-13-14-7-6-10-16(11-14)26-15-8-4-3-5-9-15/h3-12,17,19H,13H2,1-2H3
46 atoms
Cl 3.798888 -4.642326 0.86457
Cl 3.934902 -6.0057 -1.674132
O  -1.580389 -1.528309 -0.673962
O  -0.144393 -1.401891 1.04333
O  -1.257576 3.441726 1.37716
C  1.909161 -1.235618 -1.317547
C  1.960608 -2.586298 -0.661781
C  0.632711 -2.02946 -1.126515
C  2.382002 -1.075254 -2.743076
C  2.203987 -0.025838 -0.463872
C  2.527959 -3.758087 -1.340131
C  -0.372501 -1.624884 -0.116772
C  3.311767 -4.672633 -0.781886
C  -2.657763 -1.033461 0.127948
C  -2.779324 0.458503 -0.004882
C  -1.999637 1.302771 0.778055
C  -3.663749 1.003461 -0.929306
C  -2.094727 2.67852 0.621638
C  -3.761063 2.378676 -1.069825
C  -2.978331 3.225573 -0.302053
C  -1.649848 4.691342 1.765411
C  -0.807141 5.756158 1.487708
C  -2.832167 4.889501 2.467173
C  -1.14736 7.028237 1.924184
C  -3.163879 6.165938 2.89157
C  -2.325846 7.239388 2.622882
H  2.101132 -2.558109 0.412662
H  0.212795 -2.446609 -2.035304
H  2.087928 -1.901047 -3.390067
H  1.966224 -0.164148 -3.17582
H  3.46976 -0.996036 -2.780409
H  3.272761 0.192259 -0.50039
H  1.673447 0.851536 -0.839162
H  1.929694 -0.16232 0.578851
H  2.297043 -3.903484 -2.388189
H  -3.549999 -1.522824 -0.262029
H  -2.531148 -1.332893 1.168855
H  -1.311136 0.897518 1.508276
H  -4.276974 0.352529 -1.540017
H  -4.44954 2.801175 -1.789719
H  -3.054608 4.297982 -0.425509
H  0.110161 5.582187 0.940776
H  -3.482878 4.052174 2.685197
H  -0.48694 7.858165 1.710464
H  -4.082016 6.320005 3.443009
H  -2.588551 8.232644 2.960607
totalener: -1958.42664365 hartree
nucrepener: 2412.60326099 hartree
electener: -4371.02990464 hartree
oneelecener: -7478.43769059 hartree
twoeener: 3107.40778595 hartree
kineticenergy: 1952.61386931 hartree
xcener: -143.511682989808 hartree
chargesum: 0.0000000
charge: -0.040717 -0.050461 -0.260183 -0.393700 -0.295984 0.071709 0.045412 -0.082489 -0.247547 -0.255476 -0.203842 0.359079 0.050830 0.044441 0.010741 -0.190878 -0.175909 0.198400 -0.117330 -0.147561 0.202577 -0.185236 -0.135924 -0.105468 -0.123291 -0.130408 0.085735 0.075328 0.071307 0.093674 0.098655 0.089276 0.089388 0.102660 0.094715 0.097906 0.118526 0.139501 0.106936 0.126349 0.131246 0.125874 0.132922 0.125881 0.127291 0.126045
qa: -0.0407 -0.0505 -0.2602 -0.3937 -0.2960 0.0717 0.0454 -0.0825 -0.2475 -0.2555 -0.2038 0.3591 0.0508 0.0444 0.0107 -0.1909 -0.1759 0.1984 -0.1173 -0.1476 0.2026 -0.1852 -0.1359 -0.1055 -0.1233 -0.1304 0.0857 0.0753 0.0713 0.0937 0.0987 0.0893 0.0894 0.1027 0.0947 0.0979 0.1185 0.1395 0.1069 0.1263 0.1312 0.1259 0.1329 0.1259 0.1273 0.1260
va: 1.2868 1.2545 2.1384 2.1058 2.1005 3.7595 3.8199 3.8652 3.9068 3.9144 3.9195 4.2467 4.2450 3.8513 3.7198 3.9633 4.0229 3.8769 3.9711 3.9329 3.8468 4.0260 3.9502 3.9401 3.9462 3.9475 1.0508 1.0358 1.0102 1.0042 1.0025 1.0018 1.0018 1.0217 1.0311 0.9987 1.0114 1.0316 1.0119 1.0010 1.0053 1.0126 1.0033 0.9993 1.0000 1.0000
dispcorr: -0.021661069 hartree
energy: -1958.448304721462
dipole: -20.77932 19.87225 -0.90707 38.99220 -37.91212 1.08007 -4.08495 3.25065 -0.83430
magnitude: 1.63872 au
magnitude: 4.16529 debye
