program: Gaussian 09
title: 000074854
version: EM64L-G09RevD.01
frameworkgroup: C1[X(C8H8BrClO)]
method: RPBEPBE
basis: SDD
operation: Freq
keyword: #p
keyword: freq=noraman
keyword: PBEPBE/SDD
title: #p freq=noraman PBEPBE/SDD
converged: YES YES NO NO
title: Mulliken charges:
elementType: Br Cl O C C C C C C C C H H H H H H H H
charge: -0.009948 -0.063620 -0.253521 0.369026 -0.215600 -0.331026 -0.350631 -0.687765 -0.203421 -0.184251 -0.117827 0.221276 0.240864 0.248568 0.259879 0.271260 0.295768 0.253296 0.257672
chargesum: 0.00000
title: Mulliken charges with hydrogens summed into heavy atoms:
elementType: Br Cl O C C C C C C C C
charge: -0.009948 -0.063620 -0.253521 0.369026 0.246540 -0.082458 -0.090752 -0.120737 0.049875 0.073421 -0.117827
polarizability: 1.67208012e+02 4.83324320e-01 1.00413974e+02 6.15941485e+00 -3.74181276e+00 6.69583724e+01
1716.lowfreq: -0.0009 0.0014 0.0018 1.8670 4.9597 11.0663 27.2835 46.2138 84.6337
frequency: 27.2699 46.1473 84.6331 124.3541 146.4843 244.0615 261.5164 316.4453 330.5623 406.7762 416.1814 471.0423 499.0623 545.7224 619.3571 636.0384 697.1090 759.6493 800.6018 824.9885 865.5622 926.2537 953.0811 957.1336 989.9518 991.2956 1071.9570 1077.7049 1110.0864 1165.6441 1176.5428 1214.2134 1222.5959 1280.3978 1290.9608 1364.8857 1381.6846 1405.1833 1428.6392 1458.7552 1477.8844 1585.6602 1605.6200 2935.5555 3017.6948 3064.3730 3149.0513 3156.6087 3161.4220 3175.8259 3181.3972
redmass: 13.8080 5.1300 7.7037 4.4668 9.3460 2.3442 6.2442 6.6153 6.2732 3.6562 3.0274 5.3382 2.7194 4.1105 6.3256 5.6406 3.4569 3.4664 1.3088 1.5298 2.5515 1.3480 1.4558 1.9126 1.7441 3.9617 2.5389 2.4996 1.3182 1.2101 1.1721 1.3262 3.0637 1.1852 1.2662 2.5056 1.9789 3.7151 1.1160 1.1945 1.9936 7.3383 6.6725 1.0611 1.0989 1.0579 1.1099 1.0877 1.0886 1.0966 1.0978
irintensity: 0.3369 0.9055 0.9327 1.7924 2.4989 3.9861 1.0331 4.1094 5.9895 1.6638 0.1864 0.8093 24.0855 18.9201 4.8404 40.8946 0.6461 2.2909 19.1295 72.6398 8.1426 0.4155 9.6918 39.2477 27.9250 31.4091 33.9959 14.1703 14.7416 0.1101 49.9225 30.6244 248.8679 38.0669 1.6180 3.6292 22.2774 1.5830 19.9657 104.7188 124.2588 11.9245 18.4664 39.7571 19.9631 18.4094 4.3391 9.7570 1.7531 7.7024 1.0731
temp: 298.150 k
press: 1.00000 atm
elementType: 35 17 8 6 6 6 6 6 6 6 6 1 1 1 1 1 1 1 1
symmnumber: 1
zpe: 365468.9 jmol-1
zpe.correction: 0.139200 hartree
zpe.thermalcorrener: 0.150010 hartree
zpe.thermalcorrenthalpy: 0.150954 hartree
zpe.thermalcorrgfe: 0.099570 hartree
zpe.sumelectzpe: -857.566342 hartree
zpe.sumelectthermal: -857.555532 hartree
zpe.sumelectthermalent: -857.554588 hartree
zpe.sumelectthermalfe: -857.605972 hartree
dipole: 1.3869 2.8750 1.0745
dipole: 3.3680
quadrupole: -96.1353 -71.5141 -81.5916
quadrupole: 6.5002 2.6421 -1.5123
quadrupole: -13.0550 11.5662 1.4888 6.5002 2.6421 -1.5123
hfenergy: -857.705542 hartree
pointgroup: C01 [X(C8H8Br1Cl1O1)]
dipole: -0.6311372 0.9442561 -0.6825409 debye
dipolederiv: -0.2831784 -0.0837596 0.0704832 -0.1563685 -0.2120667 0.0956831 0.1791016 0.133524 -0.2777961 -0.8579284 -0.0244494 -0.102904 -0.037898 -0.1298625 -0.0130118 -0.119636 -0.011542 -0.0874135 -1.9589936 0.1818123 -0.1279411 0.2565161 -0.3120665 -0.0004252 -0.2346729 -0.0036246 -0.281046 1.6874556 -0.036438 0.1346896 0.1711112 0.008394 0.0011996 0.2769891 -0.0159305 0.1193789 0.7830854 -0.194266 -0.0067568 -0.7700293 0.3303288 0.0183088 0.1117919 0.0594181 0.2415278 -0.2901036 0.0499398 0.0122216 -0.2647532 -0.0225962 -0.0018941 -0.060599 0.0326928 -0.201164 -0.3242475 -0.013822 -0.0051524 0.1929752 0.0406299 0.0536037 0.0053751 0.0176267 -0.1618741 0.2439968 0.1730074 -0.2108812 0.2794179 0.2924235 -0.2553399 -0.3363447 -0.2561118 0.4199629 -0.1576447 -0.0733777 -0.0206138 0.0357334 0.0692138 0.0231284 -0.0049788 0.0110658 -0.0924076 -0.1311406 0.0122624 -0.000696 -0.0155317 0.0768969 0.0168743 -0.0063162 0.0232501 -0.0961243 1.1317829 0.0670072 0.1765954 0.0328463 -0.0348797 0.0114497 0.1841123 0.0184139 -0.0678776 -0.0877456 -0.0939015 0.0999935 0.1139685 -0.0569691 0.1056412 -0.011089 0.1036304 -0.0272187 0.015912 -0.0154513 -0.0431722 0.1384801 -0.0073743 -0.0621236 -0.0118414 -0.1090624 -0.0645503 0.0144309 0.0970408 -0.0149703 0.1144753 -0.0082309 -0.0141758 -0.0068928 -0.007814 0.1631243 0.0559642 -0.0655009 -0.0264247 -0.0590824 0.0016423 -0.029101 -0.0223857 -0.0283985 0.1626431 -0.030142 0.0235592 0.0282803 0.0547768 -0.0578419 0.0910878 0.0393784 0.0858689 0.0272309 0.0873363 -0.0213118 0.0633854 -0.0955796 0.0244885 -0.0001037 0.0496035 -0.0129671 -0.0961022 0.0577559 -0.05773 -0.0210897 -0.059374 -0.0092088 -0.0298154 -0.0220691 -0.0310122 0.1571966 0.0434044 0.0753794 -0.0050469 0.0683159 0.0070788 -0.0109862 -0.0095262 -0.0090276 0.1625099 unknown
polarizability: 167.1855934|4.9424998|100.3497949|2.3075951|-5.1776823|67.0449702 unknown
InChI: InChI=1S/C8H8BrClO/c9-5-6-11-8-3-1-7(10)2-4-8/h1-4H,5-6H2
charge 0 multiplicity 1
19 atoms
Br -4.474078 -0.690036 0.93797
Cl 4.497576 0.094839 0.47592
O  -1.444333 -0.344098 -0.45844
C  -0.072496 -0.152499 -0.22422
C  -2.316889 0.830475 -0.386232
C  0.53265 1.104242 0.026419
C  0.714782 -1.330581 -0.259598
C  -3.742435 0.364069 -0.626211
C  1.929628 1.176749 0.240304
C  2.104484 -1.2576 -0.047893
C  2.695558 -0.000432 0.199929
H  -2.041044 1.5527 -1.187261
H  -2.217843 1.332134 0.596722
H  -0.052963 2.027326 0.059197
H  0.223202 -2.288985 -0.449594
H  -4.425211 1.219515 -0.742149
H  -3.806516 -0.311302 -1.491939
H  2.406429 2.141742 0.435129
H  2.7167 -2.16336 -0.073052
