program: Orca
programVersion: 5.0.3
elementType: Cl Cl O O O C C C C C C C C C C C C C C C C C C C C C H H H H H H H H H H H H H H H H H H H H
charge: 0
multiplicity: 1
keywords: wb97x-d3
keywords: def2-TZVPP
keywords: def2/J RIJCOSX
keywords: DEFGRID2
keywords: scfconv7
keywords: smallprint printgap noloewdin
keywords: NOSOSCF
formula: C21H20Cl2O3
InChI: InChI=1/C21H20Cl2O3/c1-21(2)17(12-18(22)23)19(21)20(24)25-13-14-7-6-10-16(11-14)26-15-8-4-3-5-9-15/h3-12,17,19H,13H2,1-2H3
46 atoms
Cl 2.102874 -6.023222 -2.117164
Cl 4.658273 -5.06416 -3.054153
O  -0.031689 -0.054445 -1.369907
O  -0.910308 -1.999909 -0.691515
O  -1.248899 4.307159 1.506276
C  1.941873 -2.434335 0.502289
C  1.838369 -3.165638 -0.805376
C  1.462728 -1.699263 -0.731496
C  3.299494 -2.032335 1.028124
C  0.979816 -2.815277 1.601245
C  3.026146 -3.55137 -1.577397
C  0.046511 -1.305394 -0.913152
C  3.22537 -4.724347 -2.165479
C  -1.332353 0.522261 -1.518644
C  -1.780531 1.166844 -0.238127
C  -1.357874 2.457402 0.060835
C  -2.594614 0.488562 0.661227
C  -1.73776 3.06011 1.24891
C  -2.969927 1.099488 1.849025
C  -2.545204 2.381941 2.154221
C  -2.078169 5.278767 1.983965
C  -3.407373 5.386869 1.593117
C  -1.523797 6.209546 2.851977
C  -4.176747 6.430406 2.084103
C  -2.303026 7.25213 3.327038
C  -3.633567 7.365801 2.951951
H  0.993625 -3.841108 -0.877578
H  2.174973 -0.997425 -1.150935
H  3.975827 -1.679648 0.250651
H  3.196697 -1.226612 1.756143
H  3.780954 -2.874258 1.527885
H  0.772884 -1.959587 2.246363
H  0.031258 -3.188646 1.226387
H  1.426922 -3.595277 2.219238
H  3.818669 -2.821852 -1.690804
H  -1.219655 1.267865 -2.305345
H  -2.049889 -0.226016 -1.85692
H  -0.7275 3.004766 -0.629809
H  -2.924208 -0.517039 0.438201
H  -3.598078 0.568314 2.551612
H  -2.838659 2.849643 3.085252
H  -3.840697 4.669072 0.908856
H  -0.486396 6.113589 3.143901
H  -5.210813 6.512805 1.776752
H  -1.865618 7.976528 4.001269
H  -4.240145 8.177784 3.328948
totalener: -1958.42678256 hartree
nucrepener: 2378.73871887 hartree
electener: -4337.16550143 hartree
oneelecener: -7410.56496485 hartree
twoeener: 3073.39946343 hartree
kineticenergy: 1952.62457869 hartree
xcener: -143.513667497784 hartree
chargesum: -0.0000000
charge: -0.041345 -0.048815 -0.262443 -0.395751 -0.300007 0.069842 0.043787 -0.088713 -0.243228 -0.250055 -0.200422 0.366339 0.047203 0.048030 -0.001430 -0.214674 -0.129101 0.200621 -0.116002 -0.152528 0.240236 -0.153343 -0.210182 -0.123670 -0.092705 -0.145429 0.086583 0.075606 0.070841 0.094822 0.097176 0.087902 0.102071 0.087699 0.095213 0.104446 0.112767 0.110944 0.130050 0.129318 0.135071 0.131062 0.124631 0.126672 0.125234 0.125674
qa: -0.0413 -0.0488 -0.2624 -0.3958 -0.3000 0.0698 0.0438 -0.0887 -0.2432 -0.2501 -0.2004 0.3663 0.0472 0.0480 -0.0014 -0.2147 -0.1291 0.2006 -0.1160 -0.1525 0.2402 -0.1533 -0.2102 -0.1237 -0.0927 -0.1454 0.0866 0.0756 0.0708 0.0948 0.0972 0.0879 0.1021 0.0877 0.0952 0.1044 0.1128 0.1109 0.1301 0.1293 0.1351 0.1311 0.1246 0.1267 0.1252 0.1257
va: 1.2862 1.2563 2.1384 2.1049 2.1015 3.7550 3.8235 3.8730 3.9085 3.9130 3.9128 4.2268 4.2448 3.8536 3.6837 4.0945 3.9422 3.8814 3.9518 3.9566 3.8119 3.9209 4.0290 3.9570 3.9413 3.9606 1.0483 1.0370 1.0103 1.0040 1.0031 1.0021 1.0233 1.0012 1.0306 0.9964 1.0113 1.0237 1.0214 1.0004 1.0019 1.0051 1.0141 1.0001 0.9987 1.0002
dispcorr: -0.021292715 hartree
energy: -1958.448075273785
dipole: -17.72625 17.53599 -0.19026 32.41025 -31.41177 0.99848 24.84821 -24.25667 0.59154
magnitude: 1.17604 au
magnitude: 2.98927 debye
