program: Orca
programVersion: 5.0.2
elementType: Cl Cl O O O C C C C C C C C C C C C C C C C C C C C C H H H H H H H H H H H H H H H H H H H H
charge: 0
multiplicity: 1
keywords: wb97x-d3
keywords: def2-TZVPP
keywords: def2/J RIJCOSX
keywords: DEFGRID2
keywords: scfconv7
keywords: smallprint printgap noloewdin
keywords: NOSOSCF
formula: C21H20Cl2O3
InChI: InChI=1/C21H20Cl2O3/c1-21(2)17(12-18(22)23)19(21)20(24)25-13-14-7-6-10-16(11-14)26-15-8-4-3-5-9-15/h3-12,17,19H,13H2,1-2H3
46 atoms
Cl -2.785899 1.013296 3.287928
Cl -2.62652 -1.472564 1.838975
O  1.276711 2.83217 -0.856993
O  -0.024653 1.100363 -1.39306
O  3.040031 -2.577722 -0.174957
C  -2.366663 3.062151 -0.771738
C  -2.094885 2.34412 0.516469
C  -0.946712 3.000867 -0.252901
C  -3.02865 4.414721 -0.650883
C  -2.790161 2.318477 -2.013738
C  -2.203733 0.88679 0.648259
C  0.109554 2.192027 -0.893895
C  -2.498782 0.246383 1.773094
C  2.429558 2.148644 -1.37192
C  2.889218 1.075431 -0.427386
C  2.757358 -0.262934 -0.77091
C  3.424869 1.420816 0.810894
C  3.13898 -1.248655 0.130052
C  3.822812 0.429116 1.693247
C  3.672881 -0.911058 1.364138
C  1.926262 -3.044465 -0.819166
C  0.64694 -2.591628 -0.515587
C  2.117722 -4.043403 -1.76348
C  -0.440308 -3.14756 -1.174102
C  1.019644 -4.596228 -2.406426
C  -0.262386 -4.148231 -2.120364
H  -2.356955 2.898458 1.410045
H  -0.581078 3.915756 0.198142
H  -2.778624 5.045767 -1.505854
H  -4.114682 4.308027 -0.622093
H  -2.722337 4.941972 0.253539
H  -3.876001 2.206975 -2.016171
H  -2.518297 2.890605 -2.902655
H  -2.359297 1.327535 -2.120639
H  -2.045565 0.267172 -0.223545
H  2.227876 1.747715 -2.366482
H  3.183149 2.929109 -1.470319
H  2.349578 -0.531287 -1.737904
H  3.536664 2.463338 1.083433
H  4.245288 0.696615 2.653096
H  3.970352 -1.688083 2.057043
H  0.490718 -1.819676 0.227804
H  3.119973 -4.386293 -1.988732
H  -1.436331 -2.795935 -0.936969
H  1.17243 -5.376237 -3.141219
H  -1.116561 -4.576758 -2.627798
elementType: Cl O C H
totalener: -1958.44734884 hartree
nucrepener: 2609.17741575 hartree
electener: -4567.62476459 hartree
oneelecener: -7872.84198859 hartree
twoeener: 3305.21722399 hartree
cpcmener: -0.02296735 hartree
kineticenergy: 1952.56863030 hartree
xcener: -143.507842456465 hartree
chargesum: -0.0000000
charge: -0.057828 -0.063824 -0.287294 -0.473444 -0.332858 0.077341 0.044562 -0.086546 -0.255439 -0.272942 -0.207539 0.419693 0.023283 0.091214 -0.007057 -0.155836 -0.236995 0.247980 -0.118142 -0.238453 0.271559 -0.169128 -0.244262 -0.127097 -0.125273 -0.191477 0.090525 0.098013 0.095684 0.096516 0.089260 0.099097 0.100920 0.097190 0.135884 0.114531 0.127902 0.138902 0.142283 0.157547 0.146676 0.145156 0.144745 0.141956 0.156325 0.156689
qa: -0.0578 -0.0638 -0.2873 -0.4734 -0.3329 0.0773 0.0446 -0.0865 -0.2554 -0.2729 -0.2075 0.4197 0.0233 0.0912 -0.0071 -0.1558 -0.2370 0.2480 -0.1181 -0.2385 0.2716 -0.1691 -0.2443 -0.1271 -0.1253 -0.1915 0.0905 0.0980 0.0957 0.0965 0.0893 0.0991 0.1009 0.0972 0.1359 0.1145 0.1279 0.1389 0.1423 0.1575 0.1467 0.1452 0.1447 0.1420 0.1563 0.1567
va: 1.2690 1.2464 2.1315 2.0165 2.0754 3.7779 3.7985 3.8659 3.9052 3.8952 3.8676 4.0956 4.2367 3.8056 3.6173 3.8828 3.9708 3.7507 3.8881 4.0189 3.7506 3.8813 4.0009 3.8780 3.8902 3.9460 1.0276 1.0289 1.0021 1.0018 1.0049 1.0002 0.9990 1.0180 1.0107 1.0098 0.9916 1.0177 1.0062 0.9887 1.0055 1.0025 1.0083 1.0066 0.9892 0.9912
dispcorr: -0.024651535 hartree
energy: -1958.472000372848
dipole: 5.35775 -5.43653 -0.07878 13.60895 -11.75976 1.84919 -22.49243 21.83939 -0.65304
magnitude: 1.96270 au
magnitude: 4.98878 debye
