program: Orca
programVersion: 5.0.2
elementType: Cl Cl O O O C C C C C C C C C C C C C C C C C C C C C H H H H H H H H H H H H H H H H H H H H
charge: 0
multiplicity: 1
keywords: wb97x-d3
keywords: def2-TZVPP
keywords: def2/J RIJCOSX
keywords: DEFGRID2
keywords: scfconv7
keywords: smallprint printgap noloewdin
keywords: NOSOSCF
formula: C21H20Cl2O3
InChI: InChI=1/C21H20Cl2O3/c1-21(2)17(12-18(22)23)19(21)20(24)25-13-14-7-6-10-16(11-14)26-15-8-4-3-5-9-15/h3-12,17,19H,13H2,1-2H3
46 atoms
Cl -1.088433 -0.260671 1.736832
Cl -2.812241 -1.658315 -0.117587
O  0.975949 2.745816 -0.313577
O  -0.596835 1.699132 -1.519343
O  2.218015 -2.314154 0.849348
C  -2.566042 3.575454 0.026774
C  -2.481919 2.29864 0.787972
C  -1.199291 3.019889 0.388243
C  -2.971122 4.80678 0.802262
C  -3.053393 3.588799 -1.39987
C  -2.861915 1.00513 0.185272
C  -0.283575 2.410571 -0.594766
C  -2.333974 -0.151659 0.555454
C  2.04994 2.217777 -1.103973
C  2.754047 1.116855 -0.362479
C  2.123621 -0.110036 -0.159355
C  4.031727 1.329018 0.140739
C  2.782016 -1.111919 0.540144
C  4.682058 0.318069 0.835521
C  4.065122 -0.90387 1.03513
C  1.316465 -2.948723 0.043352
C  0.364612 -3.726938 0.689959
C  1.371624 -2.909594 -1.344539
C  -0.531695 -4.474812 -0.056554
C  0.454858 -3.650566 -2.078381
C  -0.497107 -4.435907 -1.443728
H  -2.679619 2.36386 1.854598
H  -0.694409 3.533345 1.197622
H  -2.574617 5.710119 0.335176
H  -4.05866 4.898054 0.833561
H  -2.611229 4.778134 1.831488
H  -4.141042 3.683833 -1.412406
H  -2.644351 4.449119 -1.932693
H  -2.796383 2.698938 -1.968219
H  -3.62962 0.985441 -0.579478
H  1.688103 1.877411 -2.07414
H  2.729886 3.051974 -1.273603
H  1.127715 -0.276503 -0.550057
H  4.520425 2.283807 -0.008705
H  5.678251 0.482465 1.225279
H  4.567464 -1.694897 1.577785
H  0.335973 -3.751736 1.772191
H  2.118698 -2.318948 -1.859173
H  -1.267265 -5.083855 0.453031
H  0.495869 -3.614665 -3.159476
H  -1.203607 -5.013777 -2.024891
elementType: Cl O C H
totalener: -1958.44431313 hartree
nucrepener: 2695.35965158 hartree
electener: -4653.80396471 hartree
oneelecener: -8046.00348415 hartree
twoeener: 3392.19951944 hartree
cpcmener: -0.02425158 hartree
kineticenergy: 1952.57074952 hartree
xcener: -143.510508618576 hartree
chargesum: 0.0000000
charge: -0.059426 -0.056098 -0.283610 -0.463957 -0.320643 0.106487 -0.039022 -0.107915 -0.258565 -0.290194 -0.167134 0.402972 0.061438 0.079807 -0.011645 -0.237753 -0.230863 0.352256 -0.097933 -0.272237 0.331542 -0.273040 -0.220954 -0.122197 -0.139224 -0.184882 0.120729 0.094507 0.096596 0.094901 0.088054 0.100923 0.100870 0.096860 0.138112 0.118404 0.111366 0.134120 0.141449 0.157170 0.143551 0.139815 0.156653 0.154424 0.158268 0.156018
qa: -0.0594 -0.0561 -0.2836 -0.4640 -0.3206 0.1065 -0.0390 -0.1079 -0.2586 -0.2902 -0.1671 0.4030 0.0614 0.0798 -0.0116 -0.2378 -0.2309 0.3523 -0.0979 -0.2722 0.3315 -0.2730 -0.2210 -0.1222 -0.1392 -0.1849 0.1207 0.0945 0.0966 0.0949 0.0881 0.1009 0.1009 0.0969 0.1381 0.1184 0.1114 0.1341 0.1414 0.1572 0.1436 0.1398 0.1567 0.1544 0.1583 0.1560
va: 1.2713 1.2532 2.1286 2.0195 2.0856 3.7563 3.8568 3.8921 3.9030 3.8983 3.8629 4.0864 4.1676 3.8122 3.7619 3.9115 3.9817 3.6401 3.8820 4.0254 3.6253 3.9768 3.9043 3.8430 3.8929 3.8830 1.0062 1.0332 1.0021 1.0022 1.0045 0.9982 1.0003 1.0154 1.0061 1.0174 1.0007 1.0225 1.0041 0.9888 1.0090 1.0135 0.9971 0.9901 0.9898 0.9900
dispcorr: -0.027207885 hartree
energy: -1958.471521015743
dipole: 1.17109 -1.33542 -0.16433 20.45472 -18.82855 1.62617 -7.82788 7.89239 0.06450
magnitude: 1.63573 au
magnitude: 4.15769 debye
