program: Orca
programVersion: 5.0.2
elementType: Cl Cl O O O C C C C C C C C C C C C C C C C C C C C C H H H H H H H H H H H H H H H H H H H H
charge: 0
multiplicity: 1
keywords: wb97x-d3
keywords: def2-TZVPP
keywords: def2/J RIJCOSX
keywords: DEFGRID2
keywords: scfconv7
keywords: smallprint printgap noloewdin
keywords: NOSOSCF
formula: C21H20Cl2O3
InChI: InChI=1/C21H20Cl2O3/c1-21(2)17(12-18(22)23)19(21)20(24)25-13-14-7-6-10-16(11-14)26-15-8-4-3-5-9-15/h3-12,17,19H,13H2,1-2H3
46 atoms
Cl -5.551311 3.03623 0.162719
Cl -5.483012 0.289815 -0.710815
O  0.554416 1.665438 1.678277
O  -0.590603 0.44773 0.200723
O  3.526367 -2.748498 -0.943858
C  -1.235194 3.288147 -0.984577
C  -2.423111 2.915268 -0.144641
C  -1.017801 2.802187 0.434185
C  -0.99994 4.764114 -1.19758
C  -0.831219 2.451681 -2.172232
C  -3.251988 1.741074 -0.435073
C  -0.365886 1.511424 0.726128
C  -4.575522 1.706507 -0.336399
C  1.349538 0.525722 2.013813
C  2.32353 0.173696 0.92429
C  2.450378 -1.14715 0.513895
C  3.112017 1.160941 0.339153
C  3.385036 -1.480669 -0.459757
C  4.022521 0.818511 -0.64807
C  4.172348 -0.501069 -1.047071
C  3.372275 -3.842287 -0.138653
C  3.875557 -3.896045 1.155957
C  2.744128 -4.945626 -0.699491
C  3.7314 -5.065417 1.889309
C  2.61926 -6.111805 0.041097
C  3.105228 -6.175878 1.339529
H  -2.965568 3.758381 0.266457
H  -0.771099 3.579893 1.146998
H  -1.304284 5.356785 -0.334099
H  0.057091 4.963775 -1.383417
H  -1.563701 5.120687 -2.061693
H  -1.018707 1.388128 -2.062173
H  -1.376588 2.789853 -3.054253
H  0.233259 2.578254 -2.377145
H  -2.77393 0.82888 -0.763777
H  1.881836 0.825536 2.917373
H  0.717422 -0.326778 2.270498
H  1.812888 -1.90602 0.951851
H  3.020738 2.194192 0.649475
H  4.63492 1.5840 -1.106704
H  4.888826 -0.770077 -1.812868
H  4.379843 -3.043404 1.5931
H  2.363254 -4.891302 -1.711574
H  4.122189 -5.107127 2.898039
H  2.13343 -6.971912 -0.401334
H  3.001967 -7.085076 1.916956
elementType: Cl O C H
totalener: -1958.44772112 hartree
nucrepener: 2450.54018753 hartree
electener: -4408.98790864 hartree
oneelecener: -7555.19816942 hartree
twoeener: 3146.21026078 hartree
cpcmener: -0.02406896 hartree
kineticenergy: 1952.57485217 hartree
xcener: -143.510122337362 hartree
chargesum: 0.0000000
charge: -0.058964 -0.061683 -0.288619 -0.462385 -0.327365 0.080994 0.042760 -0.082860 -0.254243 -0.269141 -0.221899 0.400591 0.026613 0.098119 0.036463 -0.209493 -0.265319 0.289202 -0.105881 -0.261164 0.296765 -0.203342 -0.253669 -0.140469 -0.117586 -0.189638 0.092064 0.098846 0.088885 0.095240 0.096440 0.096793 0.101796 0.099179 0.136049 0.123776 0.114663 0.141334 0.139862 0.157268 0.145837 0.155100 0.145725 0.159018 0.156929 0.157408
qa: -0.0590 -0.0617 -0.2886 -0.4624 -0.3274 0.0810 0.0428 -0.0829 -0.2542 -0.2691 -0.2219 0.4006 0.0266 0.0981 0.0365 -0.2095 -0.2653 0.2892 -0.1059 -0.2612 0.2968 -0.2033 -0.2537 -0.1405 -0.1176 -0.1896 0.0921 0.0988 0.0889 0.0952 0.0964 0.0968 0.1018 0.0992 0.1360 0.1238 0.1147 0.1413 0.1399 0.1573 0.1458 0.1551 0.1457 0.1590 0.1569 0.1574
va: 1.2681 1.2441 2.1253 2.0346 2.0804 3.7685 3.8081 3.8777 3.9087 3.9016 3.8626 4.1179 4.2321 3.8055 3.6250 3.9418 3.9652 3.7116 3.8870 4.0216 3.6871 3.9181 4.0110 3.8882 3.8828 3.9091 1.0272 1.0293 1.0052 1.0022 1.0017 1.0148 1.0009 1.0008 1.0338 0.9908 1.0103 1.0097 1.0124 0.9888 1.0072 0.9979 1.0088 0.9902 0.9893 0.9908
dispcorr: -0.022003056 hartree
energy: -1958.469724174141
dipole: 35.28355 -33.93068 1.35286 0.05603 0.98854 1.04456 -1.82176 2.54178 0.72002
magnitude: 1.85466 au
magnitude: 4.71418 debye
