program: Orca
programVersion: 5.0.2
elementType: Cl Cl O O O C C C C C C C C C C C C C C C C C C C C C H H H H H H H H H H H H H H H H H H H H
charge: 0
multiplicity: 1
keywords: wb97x-d3
keywords: def2-TZVPP
keywords: def2/J RIJCOSX
keywords: DEFGRID2
keywords: scfconv7
keywords: smallprint printgap noloewdin
keywords: NOSOSCF
formula: C21H20Cl2O3
InChI: InChI=1/C21H20Cl2O3/c1-21(2)17(12-18(22)23)19(21)20(24)25-13-14-7-6-10-16(11-14)26-15-8-4-3-5-9-15/h3-12,17,19H,13H2,1-2H3
46 atoms
Cl -1.424864 1.092832 2.809427
Cl -2.050764 -1.168176 1.132899
O  1.194519 3.204754 -0.568252
O  -0.184728 1.921039 -1.768952
O  2.621789 -2.479152 -1.084938
C  -2.489429 3.724804 -0.794853
C  -2.203804 2.827534 0.3671
C  -1.067946 3.605178 -0.307783
C  -3.158979 5.040122 -0.464275
C  -2.931641 3.171575 -2.128049
C  -2.257848 1.358325 0.269681
C  -0.016048 2.81807 -0.988185
C  -1.953126 0.541648 1.269263
C  2.282395 2.357028 -0.928684
C  2.198037 1.021449 -0.241046
C  2.411514 -0.143562 -0.962058
C  1.897268 0.943923 1.114394
C  2.349936 -1.376515 -0.330201
C  1.820323 -0.293109 1.733441
C  2.053421 -1.459646 1.02367
C  1.870297 -3.607624 -0.932634
C  2.527003 -4.825108 -1.040887
C  0.495965 -3.563791 -0.729405
C  1.803749 -6.003812 -0.947219
C  -0.211802 -4.750975 -0.626738
C  0.433775 -5.974219 -0.733835
H  -2.4635 3.218624 1.345088
H  -0.687966 4.442333 0.265955
H  -2.846908 5.428465 0.506131
H  -2.920096 5.79492 -1.214909
H  -4.243495 4.923763 -0.440765
H  -2.453312 2.2370 -2.40136
H  -4.012005 3.017951 -2.117737
H  -2.709364 3.888532 -2.91968
H  -2.559793 0.899765 -0.661585
H  2.337113 2.231317 -2.012299
H  3.170749 2.902679 -0.60829
H  2.610043 -0.104266 -2.025842
H  1.709639 1.842443 1.687454
H  1.578301 -0.352763 2.785966
H  1.997506 -2.420488 1.518222
H  3.596734 -4.84061 -1.202286
H  -0.019047 -2.614972 -0.651768
H  2.319402 -6.950981 -1.034894
H  -1.281659 -4.714833 -0.468175
H  -0.126479 -6.89576 -0.653861
totalener: -1958.42234781 hartree
nucrepener: 2650.31461952 hartree
electener: -4608.73696733 hartree
oneelecener: -7954.27929383 hartree
twoeener: 3345.54232650 hartree
kineticenergy: 1952.63110372 hartree
xcener: -143.518573902990 hartree
chargesum: 0.0000000
charge: -0.058926 -0.054113 -0.272292 -0.379097 -0.302337 0.106071 -0.053137 -0.059888 -0.235091 -0.269175 -0.145869 0.330162 0.059176 0.065291 0.059646 -0.183115 -0.214752 0.229955 -0.112879 -0.170571 0.229649 -0.206802 -0.141774 -0.095339 -0.118301 -0.142351 0.089433 0.083235 0.073499 0.092279 0.091517 0.102531 0.093103 0.087591 0.114630 0.101736 0.108902 0.103493 0.117680 0.127450 0.130356 0.123076 0.126413 0.123325 0.122212 0.123397
qa: -0.0589 -0.0541 -0.2723 -0.3791 -0.3023 0.1061 -0.0531 -0.0599 -0.2351 -0.2692 -0.1459 0.3302 0.0592 0.0653 0.0596 -0.1831 -0.2148 0.2300 -0.1129 -0.1706 0.2296 -0.2068 -0.1418 -0.0953 -0.1183 -0.1424 0.0894 0.0832 0.0735 0.0923 0.0915 0.1025 0.0931 0.0876 0.1146 0.1017 0.1089 0.1035 0.1177 0.1275 0.1304 0.1231 0.1264 0.1233 0.1222 0.1234
va: 1.2686 1.2573 2.1221 2.1064 2.1048 3.7959 3.8615 3.8409 3.8985 3.8996 3.8846 4.1890 4.1902 3.8580 3.6650 4.0810 3.9336 3.8633 3.8794 3.9572 3.8513 4.0315 3.9167 3.9386 3.9449 3.9646 1.0207 1.0313 1.0071 1.0050 1.0047 1.0252 0.9986 1.0039 1.0251 1.0097 0.9887 1.0255 1.0260 1.0068 1.0042 1.0144 1.0221 0.9989 1.0022 1.0005
dispcorr: -0.026884707 hartree
energy: -1958.449232513618
dipole: -1.77497 1.41050 -0.36448 11.47631 -10.56908 0.90723 -14.92799 15.10481 0.17682
magnitude: 0.99356 au
magnitude: 2.52543 debye
