program: Orca
programVersion: 5.0.2
elementType: Cl Cl O O O C C C C C C C C C C C C C C C C C C C C C H H H H H H H H H H H H H H H H H H H H
charge: 0
multiplicity: 1
keywords: wb97x-d3
keywords: def2-TZVPP
keywords: def2/J RIJCOSX
keywords: DEFGRID2
keywords: scfconv7
keywords: smallprint printgap noloewdin
keywords: NOSOSCF
formula: C21H20Cl2O3
InChI: InChI=1/C21H20Cl2O3/c1-21(2)17(12-18(22)23)19(21)20(24)25-13-14-7-6-10-16(11-14)26-15-8-4-3-5-9-15/h3-12,17,19H,13H2,1-2H3
46 atoms
Cl -1.394398 1.117654 2.817006
Cl -2.002514 -1.166997 1.166034
O  1.192247 3.203235 -0.571811
O  -0.181727 1.91235 -1.769521
O  2.62644 -2.480844 -1.083984
C  -2.494622 3.705703 -0.803807
C  -2.202202 2.819471 0.364338
C  -1.072173 3.600197 -0.316599
C  -3.175116 5.017227 -0.480449
C  -2.933151 3.1416 -2.133711
C  -2.242903 1.348767 0.279465
C  -0.016783 2.812865 -0.992299
C  -1.924299 0.54457 1.284902
C  2.282523 2.357082 -0.92922
C  2.198896 1.020862 -0.242321
C  2.415784 -0.144033 -0.963004
C  1.894799 0.942792 1.11224
C  2.353435 -1.376833 -0.331224
C  1.81805 -0.294466 1.731211
C  2.054017 -1.460514 1.021723
C  1.859755 -3.600727 -0.945648
C  2.50152 -4.825622 -1.061049
C  0.485099 -3.5412 -0.749351
C  1.762689 -5.995907 -0.980491
C  -0.238354 -4.720177 -0.659843
C  0.392099 -5.950888 -0.772662
H  -2.465609 3.216792 1.338691
H  -0.697169 4.443891 0.25119
H  -4.2585 4.890432 -0.449153
H  -2.861381 5.417021 0.484821
H  -2.948662 5.768565 -1.238746
H  -4.013849 2.988636 -2.125607
H  -2.708447 3.851473 -2.930907
H  -2.454618 2.204605 -2.398916
H  -2.544362 0.878632 -0.64667
H  2.341239 2.232443 -2.012624
H  3.168838 2.90411 -0.606066
H  2.616856 -0.104602 -2.026457
H  1.704229 1.841246 1.684778
H  1.572454 -0.354445 2.78281
H  1.99728 -2.421943 1.515315
H  3.571975 -4.853859 -1.217204
H  -0.018387 -2.586518 -0.666741
H  2.2669 -6.948946 -1.07276
H  -1.308365 -4.671321 -0.505364
H  -0.180178 -6.865981 -0.70267
totalener: -1958.42223664 hartree
nucrepener: 2653.54479628 hartree
electener: -4611.96703292 hartree
oneelecener: -7960.73787464 hartree
twoeener: 3348.77084172 hartree
kineticenergy: 1952.62775250 hartree
xcener: -143.518088011996 hartree
chargesum: -0.0000000
charge: -0.059227 -0.053591 -0.272070 -0.378775 -0.302549 0.105400 -0.054799 -0.059010 -0.235456 -0.268244 -0.146284 0.329326 0.060760 0.064757 0.058910 -0.182230 -0.212907 0.229338 -0.113722 -0.171153 0.229348 -0.207132 -0.141555 -0.095013 -0.118340 -0.142903 0.089784 0.083265 0.091660 0.073547 0.092230 0.092630 0.087908 0.102367 0.114844 0.101774 0.109029 0.103594 0.117919 0.127762 0.130411 0.123062 0.126692 0.123267 0.122072 0.123307
qa: -0.0592 -0.0536 -0.2721 -0.3788 -0.3025 0.1054 -0.0548 -0.0590 -0.2355 -0.2682 -0.1463 0.3293 0.0608 0.0648 0.0589 -0.1822 -0.2129 0.2293 -0.1137 -0.1712 0.2293 -0.2071 -0.1416 -0.0950 -0.1183 -0.1429 0.0898 0.0833 0.0917 0.0735 0.0922 0.0926 0.0879 0.1024 0.1148 0.1018 0.1090 0.1036 0.1179 0.1278 0.1304 0.1231 0.1267 0.1233 0.1221 0.1233
va: 1.2684 1.2585 2.1224 2.1065 2.1043 3.7973 3.8623 3.8395 3.8987 3.8994 3.8852 4.1897 4.1909 3.8586 3.6659 4.0813 3.9300 3.8624 3.8775 3.9582 3.8518 4.0314 3.9147 3.9386 3.9448 3.9648 1.0205 1.0312 1.0047 1.0070 1.0050 0.9987 1.0039 1.0252 1.0247 1.0096 0.9887 1.0254 1.0263 1.0071 1.0041 1.0143 1.0222 0.9989 1.0025 1.0006
dispcorr: -0.027018219 hartree
energy: -1958.449254856150
dipole: -2.12610 1.74742 -0.37868 11.32405 -10.41300 0.91105 -15.15937 15.32843 0.16906
magnitude: 1.00100 au
magnitude: 2.54433 debye
