program: Orca
programVersion: 5.0.2
elementType: Cl Cl O O O C C C C C C C C C C C C C C C C C C C C C H H H H H H H H H H H H H H H H H H H H
charge: 0
multiplicity: 1
keywords: wb97x-d3
keywords: def2-TZVPP
keywords: def2/J RIJCOSX
keywords: DEFGRID2
keywords: scfconv7
keywords: smallprint printgap noloewdin
keywords: NOSOSCF
formula: C21H20Cl2O3
InChI: InChI=1/C21H20Cl2O3/c1-21(2)17(12-18(22)23)19(21)20(24)25-13-14-7-6-10-16(11-14)26-15-8-4-3-5-9-15/h3-12,17,19H,13H2,1-2H3
46 atoms
Cl -5.144834 2.475905 -0.036534
Cl -4.239688 2.396356 2.698234
O  1.296048 1.98982 -1.069717
O  0.31081 1.471187 0.86904
O  3.484617 -2.543311 -0.869517
C  -1.65653 -0.022757 -1.103686
C  -2.334179 1.258335 -0.713019
C  -0.894982 1.284289 -1.205206
C  -2.066485 -0.63929 -2.419999
C  -1.295018 -1.053055 -0.064637
C  -2.703573 1.563135 0.675928
C  0.256727 1.581089 -0.326108
C  -3.871033 2.072327 1.049723
C  2.515312 2.256626 -0.401172
C  3.318416 1.019255 -0.095988
C  2.988307 -0.223873 -0.610623
C  4.461401 1.148772 0.688497
C  3.791671 -1.322864 -0.333386
C  5.263856 0.051368 0.944488
C  4.931991 -1.198158 0.43924
C  2.339656 -3.163857 -0.46547
C  1.837273 -3.044669 0.824985
C  1.701682 -3.974878 -1.39545
C  0.701091 -3.757349 1.179175
C  0.567896 -4.680565 -1.02585
C  0.061121 -4.576615 0.261763
H  -3.029841 1.644421 -1.449184
H  -0.770569 1.664493 -2.212433
H  -2.325278 0.113654 -3.165388
H  -1.258583 -1.249907 -2.826917
H  -2.935866 -1.284653 -2.284692
H  -2.155761 -1.69508 0.126949
H  -0.488521 -1.691215 -0.427517
H  -0.975505 -0.634476 0.884862
H  -1.987555 1.366455 1.460951
H  3.075058 2.896542 -1.085439
H  2.340582 2.823005 0.516903
H  2.118408 -0.356323 -1.24137
H  4.726811 2.115483 1.099686
H  6.151356 0.163605 1.552818
H  5.548422 -2.06488 0.636814
H  2.325731 -2.4072 1.550489
H  2.104343 -4.054418 -2.396736
H  0.314271 -3.665909 2.185519
H  0.076602 -5.313418 -1.753227
H  -0.824563 -5.127688 0.546897
totalener: -1958.42451120 hartree
nucrepener: 2569.25531204 hartree
electener: -4527.67982324 hartree
oneelecener: -7791.63711307 hartree
twoeener: 3263.95728983 hartree
kineticenergy: 1952.61422291 hartree
xcener: -143.516901065596 hartree
chargesum: -0.0000000
charge: -0.053953 -0.047867 -0.278650 -0.379611 -0.301987 0.093552 0.050072 -0.078151 -0.232435 -0.226383 -0.231498 0.321796 0.040499 0.047603 0.056755 -0.137345 -0.190833 0.178785 -0.093729 -0.184689 0.210730 -0.125958 -0.190833 -0.144252 -0.091499 -0.148939 0.076180 0.088772 0.074436 0.089505 0.092179 0.096522 0.045482 0.102522 0.129247 0.118572 0.110844 0.118165 0.110041 0.126541 0.128627 0.129764 0.125372 0.126536 0.124901 0.124613
qa: -0.0540 -0.0479 -0.2786 -0.3796 -0.3020 0.0936 0.0501 -0.0782 -0.2324 -0.2264 -0.2315 0.3218 0.0405 0.0476 0.0568 -0.1373 -0.1908 0.1788 -0.0937 -0.1847 0.2107 -0.1260 -0.1908 -0.1443 -0.0915 -0.1489 0.0762 0.0888 0.0744 0.0895 0.0922 0.0965 0.0455 0.1025 0.1292 0.1186 0.1108 0.1182 0.1100 0.1265 0.1286 0.1298 0.1254 0.1265 0.1249 0.1246
va: 1.2746 1.2586 2.1263 2.0991 2.0911 3.7733 3.8183 3.8871 3.9089 3.8945 3.8938 4.1614 4.2421 3.8727 3.6768 3.9962 4.0235 3.8801 3.9330 4.0280 3.8268 3.8555 3.9932 3.9168 3.9226 3.9157 1.0359 1.0298 1.0093 1.0054 1.0041 1.0059 1.0161 1.0188 1.0386 0.9855 1.0114 1.0183 1.0086 0.9993 1.0100 1.0084 1.0144 1.0021 0.9984 1.0013
dispcorr: -0.025629040 hartree
energy: -1958.450140239963
dipole: 23.95426 -23.30586 0.64840 -21.64115 21.41727 -0.22388 -12.16875 11.51678 -0.65197
magnitude: 0.94636 au
magnitude: 2.40547 debye
