program: Gaussian 09
title: 000074982
version: EM64L-G09RevD.01
frameworkgroup: C1[X(C20H26N2)]
method: RPBEPBE
basis: SDD
operation: Freq
keyword: #pfreq=noraman
keyword: PBEPBE/SDD
title: #p freq=noraman PBEPBE/SDD
converged: YES YES NO NO
title: Mulliken charges:
elementType: N N C C C C C C C C C C C C C C C C C C C C H H H H H H H H H H H H H H H H H H H H H H H H H H
charge: -0.282236 -0.099776 -0.441926 0.217475 0.187096 -0.600669 -0.526555 -0.383152 0.396507 0.341084 -0.325896 -0.328905 -0.341089 -0.330246 -0.430394 -0.369212 -0.248126 -0.269090 -0.252584 -0.276404 -0.674850 -0.671943 0.202401 0.256784 0.211663 0.240362 0.224293 0.209095 0.237840 0.218032 0.191046 0.203842 0.189534 0.203671 0.247089 0.228116 0.234419 0.225129 0.225234 0.223580 0.225987 0.226356 0.225680 0.208444 0.207306 0.226543 0.212521 0.205923
chargesum: 0.00000
title: Mulliken charges with hydrogens summed into heavy atoms:
elementType: N N C C C C C C C C C C C C C C C C C C C C
charge: -0.282236 -0.099776 0.017258 0.217475 0.187096 -0.167281 -0.070684 0.068874 0.396507 0.341084 0.068992 0.064300 -0.094000 -0.102129 -0.195975 -0.144083 -0.022892 -0.045510 -0.026597 -0.050048 -0.033420 -0.026956
polarizability: 2.42095419e+02 -2.30955196e+01 2.74071246e+02 2.73432047e+01 9.66533209e+00 1.79757447e+02
1716.lowfreq: -12.9833 -0.8474 -0.0010 -0.0008 -0.0006 11.7771 14.5629 29.3259 37.0914
frequency: 9.5536 29.2998 36.9659 43.5122 59.1476 67.4825 87.8111 109.7944 130.8546 146.3025 159.4232 192.5342 225.9586 234.8832 265.1698 285.2012 293.4027 299.9612 318.5164 330.9973 363.5274 390.5118 399.6973 433.9315 443.6326 461.4327 474.1973 490.9340 515.9968 540.8142 559.3653 588.7940 601.3263 616.5591 674.4471 711.9790 735.3913 747.6422 751.6884 763.0089 768.1026 783.9146 792.2785 794.9414 807.2706 849.4957 865.8160 865.9452 914.9029 923.3011 934.7830 940.5832 966.4925 971.1056 977.8640 987.5649 1023.7101 1037.4587 1043.7846 1047.1986 1060.0066 1070.5469 1074.7979 1075.0832 1084.9784 1110.6871 1120.0926 1127.0288 1161.6360 1162.4731 1172.4625 1175.4882 1197.5761 1206.2026 1208.7864 1219.4473 1228.1475 1243.0970 1268.4231 1280.8450 1286.1452 1293.2774 1295.8762 1309.9881 1323.6948 1343.9635 1355.6675 1361.5370 1363.7483 1376.1093 1377.2316 1385.0657 1385.4810 1388.5198 1433.1344 1443.5694 1454.3385 1460.7568 1463.9165 1465.0745 1467.4947 1476.2058 1481.6515 1484.9849 1485.3516 1491.1514 1493.0659 1499.7351 1579.7963 1591.8895 1603.8737 1613.2778 2852.6451 2861.6885 2924.6317 2961.5007 2963.4655 2981.2700 2983.4829 2984.3381 3014.2008 3018.3487 3034.7294 3041.8387 3050.4054 3074.0222 3076.0448 3090.2237 3090.6463 3091.3340 3109.2962 3117.1227 3127.4968 3127.9128 3143.6313 3154.4190 3161.7277 3168.9370
redmass: 3.2405 3.9697 3.6773 3.9061 2.7332 2.8775 2.2258 3.2082 2.7690 2.8848 2.2027 1.9006 1.6844 1.6270 2.8601 2.0159 2.4893 3.5411 3.1431 3.6549 3.1783 3.3237 3.6550 2.7932 2.7519 3.4089 3.2277 2.8770 3.6343 3.8670 4.4254 3.0695 4.3861 5.3092 5.1814 3.0370 2.7734 2.2242 1.6420 1.6118 2.0489 1.4643 1.5255 1.3407 1.7894 1.3623 2.1047 1.7045 1.9155 2.3044 1.5049 1.3938 2.0713 1.3615 1.3191 2.2707 4.8707 2.7748 2.2654 2.8928 2.1319 2.0172 2.2057 2.2277 2.2258 1.9495 1.8019 1.9085 1.3610 1.3628 1.0573 1.2118 1.6280 2.3297 2.4226 2.2551 1.4247 1.6309 1.3985 1.2224 1.2195 1.1936 1.3874 1.6031 1.5711 1.6717 1.9788 1.3541 1.3851 3.0102 1.5435 2.0292 1.7995 1.2448 2.2276 2.3410 1.1539 1.0545 1.0535 1.1769 1.0654 1.0720 1.3636 1.2833 1.1071 1.1080 2.3359 1.2328 6.5824 7.2452 6.2445 6.2103 1.0719 1.0714 1.0685 1.0704 1.0619 1.0356 1.0357 1.0627 1.0875 1.0975 1.0872 1.0909 1.1009 1.0985 1.0981 1.0951 1.0981 1.1003 1.0877 1.0867 1.0877 1.0878 1.0937 1.0943 1.1006 1.0967
irintensity: 0.1329 0.1111 0.1335 0.1500 0.2507 0.1646 0.4271 0.7015 1.0090 0.8155 0.6990 1.9739 2.4688 1.3263 1.1813 0.9278 0.1285 0.3743 1.7531 1.5223 1.4641 4.2226 3.1036 7.6437 1.2183 0.4920 6.0363 7.1819 1.1629 0.9570 0.3800 5.3586 19.1195 12.3732 0.2848 2.5143 5.2812 43.4385 25.3850 72.7577 29.2802 9.0817 7.8799 5.3291 3.3994 2.7407 0.7993 0.4392 1.5484 12.3376 5.6221 2.9951 1.3994 0.6194 0.0118 4.5614 7.8591 10.8361 6.4871 15.4629 8.2719 21.9801 8.0627 45.9032 3.4457 45.1065 7.2301 27.5294 19.8432 9.7555 0.0416 2.2458 0.1203 16.8911 53.2991 44.7729 11.1199 13.5001 14.7055 9.2073 20.6836 5.9080 2.5657 83.9573 2.8272 62.8691 6.7520 6.5502 6.7560 4.3243 1.8599 12.1671 8.3821 24.8099 23.6167 44.0419 20.9118 6.4265 4.6204 15.8778 3.7817 6.9203 121.7072 65.2548 32.8742 6.3682 19.8030 29.3829 25.9821 12.2452 41.5960 18.3404 32.8285 163.2618 55.2152 57.4329 26.1663 29.4697 35.2058 22.8377 26.4255 42.3964 17.3101 23.4660 29.8679 40.8860 79.7027 25.9533 28.6020 47.4770 14.5585 8.9858 9.9626 8.0180 28.7305 37.8942 30.7631 22.3450
temp: 298.150 k
press: 1.00000 atm
elementType: 7 7 6 6 6 6 6 6 6 6 6 6 6 6 6 6 6 6 6 6 6 6 1 1 1 1 1 1 1 1 1 1 1 1 1 1 1 1 1 1 1 1 1 1 1 1 1 1
symmnumber: 1
zpe: 1083678.5 jmol-1
zpe.correction: 0.412751 hartree
zpe.thermalcorrener: 0.433908 hartree
zpe.thermalcorrenthalpy: 0.434852 hartree
zpe.thermalcorrgfe: 0.360478 hartree
zpe.sumelectzpe: -885.573449 hartree
zpe.sumelectthermal: -885.552293 hartree
zpe.sumelectthermalent: -885.551349 hartree
zpe.sumelectthermalfe: -885.625723 hartree
dipole: -0.8754 -0.2238 0.8619
dipole: 1.2487
quadrupole: -124.3411 -130.9724 -130.0121
quadrupole: -3.5882 5.1051 1.0159
quadrupole: 4.1007 -2.5305 -1.5702 -3.5882 5.1051 1.0159
hfenergy: -885.9862008 hartree
pointgroup: C01 [X(C20H26N2)]
dipole: 0.3447326 0.0556308 0.3455728 debye
polarizability: 245.0739803|-20.2014021|270.4979594|-32.7504398|5.8412678|180.3521725 unknown
InChI: InChI=1S/C20H26N2/c1-3-21(4-2)15-16-22-19-11-7-5-9-17(19)13-14-18-10-6-8-12-20(18)22/h5-12H,3-4,13-16H2,1-2H3
charge 0 multiplicity 1
48 atoms
N  -0.338211 0.081471 -0.266394
N  3.382766 0.727256 0.313939
C  1.015604 0.661288 -0.479224
C  -1.429313 1.020661 -0.205641
C  -0.527821 -1.332336 -0.430435
C  -2.329793 -0.195877 1.820989
C  -2.657836 -1.540225 1.12632
C  2.027238 0.192907 0.59868
C  -2.400504 0.943398 0.831606
C  -1.590874 -2.086431 0.175442
C  4.201069 -0.199344 -0.51375
C  4.089363 1.235016 1.519372
C  -1.50422 2.074185 -1.156211
C  0.409764 -2.040184 -1.2465
C  -3.433182 1.909337 0.880019
C  -1.667629 -3.478597 -0.091869
C  -2.530455 3.039299 -1.084358
C  0.310224 -3.422401 -1.485577
C  -3.505024 2.958773 -0.063083
C  -0.746336 -4.160582 -0.910271
C  5.296084 0.516298 -1.327644
C  3.528004 2.582357 2.012267
H  1.420026 0.457382 -1.492052
H  0.929564 1.755861 -0.397422
H  1.676831 0.568251 1.577175
H  2.026759 -0.91815 0.66726
H  -1.318507 -0.256462 2.268973
H  -3.051034 -0.028734 2.641828
H  -3.616569 -1.418957 0.581821
H  -2.839218 -2.311454 1.9001
H  4.659711 -1.008049 0.110722
H  3.516196 -0.707163 -1.219541
H  4.066265 0.487788 2.352872
H  5.153154 1.374335 1.25434
H  -0.76677 2.122615 -1.965077
H  1.222113 -1.49118 -1.729305
H  -4.179147 1.84414 1.681754
H  -2.481766 -4.043184 0.381251
H  -2.575616 3.840859 -1.830219
H  1.051375 -3.914152 -2.125958
H  -4.306354 3.70315 -0.002251
H  -0.844223 -5.237197 -1.083841
H  4.843678 1.282768 -1.98072
H  6.035299 1.017625 -0.67704
H  5.844796 -0.20953 -1.956675
H  3.615969 3.343364 1.217432
H  2.461178 2.504622 2.290899
H  4.082772 2.931586 2.903296
