program: Orca
programVersion: 5.0.2
elementType: Cl Cl O O O C C C C C C C C C C C C C C C C C C C C C H H H H H H H H H H H H H H H H H H H H
charge: 0
multiplicity: 1
keywords: wb97x-d3
keywords: def2-TZVPP
keywords: def2/J RIJCOSX
keywords: DEFGRID2
keywords: scfconv7
keywords: smallprint printgap noloewdin
keywords: NOSOSCF
formula: C21H20Cl2O3
InChI: InChI=1/C21H20Cl2O3/c1-21(2)17(12-18(22)23)19(21)20(24)25-13-14-7-6-10-16(11-14)26-15-8-4-3-5-9-15/h3-12,17,19H,13H2,1-2H3
46 atoms
Cl -3.203848 0.885138 3.048569
Cl -2.686791 -1.555828 1.609652
O  1.293654 2.827094 -0.847956
O  -0.039385 1.18245 -1.560589
O  2.969616 -2.573749 -0.056043
C  -2.368429 3.077593 -0.7619
C  -2.063305 2.307445 0.48903
C  -0.938953 3.001005 -0.279052
C  -3.03591 4.420251 -0.572272
C  -2.827056 2.372138 -2.014393
C  -2.156048 0.843926 0.558722
C  0.113143 2.219244 -0.967723
C  -2.619995 0.164925 1.600327
C  2.440792 2.142157 -1.363755
C  2.911999 1.074823 -0.417724
C  2.687484 -0.265455 -0.703198
C  3.566117 1.432289 0.756737
C  3.115617 -1.243003 0.187092
C  3.994874 0.450957 1.634865
C  3.768637 -0.887776 1.358978
C  1.877328 -3.039728 -0.731956
C  0.587804 -2.61304 -0.439079
C  2.096839 -4.016365 -1.69224
C  -0.480455 -3.170957 -1.123699
C  1.017753 -4.573267 -2.361062
C  -0.273439 -4.149747 -2.085111
H  -2.315439 2.813526 1.41354
H  -0.561481 3.896515 0.200148
H  -2.8133 5.083915 -1.40944
H  -4.119452 4.305518 -0.515545
H  -2.707428 4.917411 0.341248
H  -3.905755 2.21548 -1.965987
H  -2.622953 2.991363 -2.889282
H  -2.354895 1.409777 -2.182417
H  -1.815745 0.261885 -0.286638
H  2.232508 1.731065 -2.352666
H  3.195423 2.921024 -1.470978
H  2.171114 -0.540355 -1.613954
H  3.743223 2.476604 0.982095
H  4.50709 0.727014 2.546967
H  4.098125 -1.660474 2.040871
H  0.412505 -1.858761 0.317571
H  3.108254 -4.338456 -1.902903
H  -1.483992 -2.839447 -0.892551
H  1.191444 -5.338377 -3.106301
H  -1.113627 -4.582061 -2.611314
totalener: -1958.42598468 hartree
nucrepener: 2607.36828130 hartree
electener: -4565.79426598 hartree
oneelecener: -7868.19080516 hartree
twoeener: 3302.39653918 hartree
kineticenergy: 1952.61675211 hartree
xcener: -143.514779737510 hartree
chargesum: 0.0000000
charge: -0.050410 -0.052060 -0.265183 -0.412566 -0.299980 0.066103 0.062886 -0.098243 -0.234223 -0.250112 -0.227791 0.389995 0.042470 0.050058 -0.022174 -0.116873 -0.198314 0.222800 -0.083070 -0.211807 0.227754 -0.125257 -0.213099 -0.080551 -0.091919 -0.160536 0.074142 0.085875 0.090047 0.092586 0.074249 0.090968 0.087249 0.103410 0.128787 0.106984 0.114007 0.127081 0.109897 0.124978 0.125698 0.120153 0.122875 0.107223 0.122600 0.123290
qa: -0.0504 -0.0521 -0.2652 -0.4126 -0.3000 0.0661 0.0629 -0.0982 -0.2342 -0.2501 -0.2278 0.3900 0.0425 0.0501 -0.0222 -0.1169 -0.1983 0.2228 -0.0831 -0.2118 0.2278 -0.1253 -0.2131 -0.0806 -0.0919 -0.1605 0.0741 0.0859 0.0900 0.0926 0.0742 0.0910 0.0872 0.1034 0.1288 0.1070 0.1140 0.1271 0.1099 0.1250 0.1257 0.1202 0.1229 0.1072 0.1226 0.1233
va: 1.2775 1.2629 2.1427 2.0668 2.1109 3.7666 3.7883 3.8901 3.9111 3.9070 3.9163 4.1270 4.2352 3.8576 3.6942 3.8701 4.0229 3.8639 3.9358 4.0479 3.8921 3.9361 4.0376 3.9186 3.9354 4.0237 1.0350 1.0300 1.0044 1.0041 1.0082 1.0014 1.0023 1.0210 1.0151 1.0118 0.9921 1.0244 1.0129 0.9988 1.0129 1.0101 1.0143 1.0244 0.9991 1.0016
dispcorr: -0.024636228 hartree
energy: -1958.450620905821
dipole: 7.10527 -7.07414 0.03113 14.26351 -13.05646 1.20705 -20.82083 20.41956 -0.40128
magnitude: 1.27238 au
magnitude: 3.23414 debye
