program: Orca
programVersion: 5.0.2
elementType: Cl Cl O O O C C C C C C C C C C C C C C C C C C C C C H H H H H H H H H H H H H H H H H H H H
charge: 0
multiplicity: 1
keywords: wb97x-d3
keywords: def2-TZVPP
keywords: def2/J RIJCOSX
keywords: DEFGRID2
keywords: scfconv7
keywords: smallprint printgap noloewdin
keywords: NOSOSCF
formula: C21H20Cl2O3
InChI: InChI=1/C21H20Cl2O3/c1-21(2)17(12-18(22)23)19(21)20(24)25-13-14-7-6-10-16(11-14)26-15-8-4-3-5-9-15/h3-12,17,19H,13H2,1-2H3
46 atoms
Cl -1.17906 -0.542842 -1.269163
Cl -0.963411 0.802101 -3.814803
O  0.392457 1.906575 1.450287
O  0.047442 3.103469 -0.408565
O  2.375592 -2.987415 0.315815
C  -2.92473 3.19459 0.417212
C  -2.737468 1.914423 -0.32432
C  -1.810792 2.263642 0.839762
C  -4.091508 3.257266 1.376226
C  -2.642516 4.519624 -0.247131
C  -2.221626 1.877653 -1.708908
C  -0.382181 2.498721 0.538303
C  -1.552694 0.846609 -2.203831
C  1.791296 1.815426 1.156434
C  2.05185 0.670247 0.219536
C  2.090938 -0.622562 0.730542
C  2.204069 0.878838 -1.145674
C  2.270878 -1.701335 -0.123678
C  2.39219 -0.205208 -1.989725
C  2.420908 -1.494738 -1.488335
C  1.664675 -3.433638 1.388836
C  0.35391 -3.046426 1.642724
C  2.290549 -4.364851 2.206948
C  -0.318556 -3.595292 2.723831
C  1.602101 -4.912651 3.27747
C  0.296623 -4.527884 3.545609
H  -3.434603 1.114711 -0.089433
H  -1.982403 1.703025 1.75106
H  -3.897913 3.973025 2.176857
H  -4.998801 3.572975 0.858352
H  -4.295266 2.290651 1.838843
H  -1.811282 4.492342 -0.944841
H  -3.532221 4.854635 -0.783913
H  -2.411535 5.275838 0.504573
H  -2.39407 2.723247 -2.362096
H  2.16625 2.756008 0.751367
H  2.266938 1.644695 2.121673
H  1.984264 -0.781455 1.797189
H  2.159774 1.88128 -1.547762
H  2.503129 -0.045323 -3.053784
H  2.5620 -2.344235 -2.143532
H  -0.141524 -2.324593 1.00684
H  3.309857 -4.659112 1.993306
H  -1.339093 -3.292443 2.91807
H  2.094506 -5.641126 3.908216
H  -0.237601 -4.952961 4.384319
totalener: -1958.42132029 hartree
nucrepener: 2678.68836183 hartree
electener: -4637.10968212 hartree
oneelecener: -8011.09423466 hartree
twoeener: 3373.98455254 hartree
kineticenergy: 1952.63538663 hartree
xcener: -143.519631953773 hartree
chargesum: -0.0000000
charge: -0.048749 -0.050308 -0.260601 -0.391047 -0.297349 0.109529 -0.063718 -0.083720 -0.237685 -0.277330 -0.167768 0.346815 0.093306 0.053134 0.014751 -0.221950 -0.146719 0.257801 -0.115860 -0.193400 0.267862 -0.163453 -0.213681 -0.130542 -0.091606 -0.143473 0.101743 0.081347 0.092702 0.089702 0.072964 0.106509 0.090306 0.087489 0.108813 0.109484 0.104463 0.118909 0.125080 0.123100 0.122574 0.124130 0.123636 0.123563 0.125212 0.124036
qa: -0.0487 -0.0503 -0.2606 -0.3910 -0.2973 0.1095 -0.0637 -0.0837 -0.2377 -0.2773 -0.1678 0.3468 0.0933 0.0531 0.0148 -0.2219 -0.1467 0.2578 -0.1159 -0.1934 0.2679 -0.1635 -0.2137 -0.1305 -0.0916 -0.1435 0.1017 0.0813 0.0927 0.0897 0.0730 0.1065 0.0903 0.0875 0.1088 0.1095 0.1045 0.1189 0.1251 0.1231 0.1226 0.1241 0.1236 0.1236 0.1252 0.1240
va: 1.2973 1.2576 2.1320 2.0841 2.1163 3.7418 3.8946 3.8588 3.9038 3.9005 3.9141 4.1642 4.1886 3.8633 3.6514 3.9812 3.9007 3.8112 3.9328 4.0060 3.7865 3.9377 4.0366 3.9767 3.9337 3.9588 1.0096 1.0341 1.0044 1.0049 1.0071 1.0195 0.9978 1.0046 1.0199 1.0108 0.9965 1.0134 1.0241 1.0058 1.0130 1.0014 1.0153 1.0003 0.9987 1.0008
dispcorr: -0.027439482 hartree
energy: -1958.448759766877
dipole: -7.41721 6.73631 -0.68091 11.00833 -10.67212 0.33621 21.54104 -20.70807 0.83298
magnitude: 1.12717 au
magnitude: 2.86505 debye
