program: Orca
programVersion: 5.0.2
elementType: Cl Cl O O O C C C C C C C C C C C C C C C C C C C C C H H H H H H H H H H H H H H H H H H H H
charge: 0
multiplicity: 1
keywords: wb97x-d3
keywords: def2-TZVPP
keywords: def2/J RIJCOSX
keywords: DEFGRID2
keywords: scfconv7
keywords: smallprint printgap noloewdin
keywords: NOSOSCF
formula: C21H20Cl2O3
InChI: InChI=1/C21H20Cl2O3/c1-21(2)17(12-18(22)23)19(21)20(24)25-13-14-7-6-10-16(11-14)26-15-8-4-3-5-9-15/h3-12,17,19H,13H2,1-2H3
46 atoms
Cl -0.022052 0.787122 2.14904
Cl -2.077519 -1.237281 2.050142
O  0.930389 2.799398 -0.918137
O  -0.587224 1.173046 -1.171589
O  2.679116 -2.656835 -0.075759
C  -2.625207 3.372345 -0.295474
C  -2.204206 2.69268 0.965285
C  -1.148993 3.193575 -0.003593
C  -3.143759 4.787188 -0.187104
C  -3.298261 2.574868 -1.385586
C  -2.485951 1.26033 1.198792
C  -0.28132 2.257052 -0.754458
C  -1.637249 0.396178 1.73461
C  1.936565 1.982824 -1.517056
C  2.469259 0.971605 -0.542874
C  2.29551 -0.382284 -0.780828
C  3.12611 1.394012 0.609105
C  2.777481 -1.315047 0.130431
C  3.603074 0.45863 1.511488
C  3.427769 -0.897471 1.281623
C  1.571026 -3.180119 -0.679537
C  1.765799 -4.227221 -1.568384
C  0.290142 -2.732399 -0.384606
C  0.668428 -4.829948 -2.16415
C  -0.796481 -3.337967 -0.994307
C  -0.615653 -4.386135 -1.885211
H  -2.264229 3.293171 1.870088
H  -0.632839 4.089787 0.319462
H  -4.217346 4.789252 0.009299
H  -2.659939 5.341467 0.618124
H  -2.975223 5.335284 -1.115375
H  -4.376211 2.55569 -1.212323
H  -3.133384 3.04384 -2.356781
H  -2.946506 1.549265 -1.452855
H  -3.478303 0.89556 0.960951
H  1.558146 1.497769 -2.418734
H  2.717128 2.684433 -1.81191
H  1.769379 -0.705904 -1.66998
H  3.262979 2.450987 0.800668
H  4.114616 0.78363 2.407865
H  3.794199 -1.633593 1.984717
H  2.771044 -4.564878 -1.784012
H  0.138105 -1.920201 0.313266
H  0.822243 -5.646752 -2.857047
H  -1.791618 -2.983141 -0.761492
H  -1.469012 -4.85411 -2.357016
totalener: -1958.42159254 hartree
nucrepener: 2720.88212942 hartree
electener: -4679.30372197 hartree
oneelecener: -8095.77875819 hartree
twoeener: 3416.47503622 hartree
kineticenergy: 1952.64108624 hartree
xcener: -143.520982014693 hartree
chargesum: -0.0000000
charge: -0.040211 -0.056671 -0.260786 -0.378713 -0.300732 0.097920 -0.030494 -0.079624 -0.236630 -0.279165 -0.199599 0.318780 0.113890 0.058250 0.007381 -0.115271 -0.243343 0.231466 -0.076012 -0.204577 0.217938 -0.205510 -0.095544 -0.099026 -0.099447 -0.140706 0.099319 0.082912 0.088202 0.073362 0.092163 0.087736 0.089379 0.114562 0.113822 0.100232 0.113975 0.119987 0.109564 0.124988 0.123915 0.122438 0.082343 0.121874 0.114190 0.121476
qa: -0.0402 -0.0567 -0.2608 -0.3787 -0.3007 0.0979 -0.0305 -0.0796 -0.2366 -0.2792 -0.1996 0.3188 0.1139 0.0583 0.0074 -0.1153 -0.2433 0.2315 -0.0760 -0.2046 0.2179 -0.2055 -0.0955 -0.0990 -0.0994 -0.1407 0.0993 0.0829 0.0882 0.0734 0.0922 0.0877 0.0894 0.1146 0.1138 0.1002 0.1140 0.1200 0.1096 0.1250 0.1239 0.1224 0.0823 0.1219 0.1142 0.1215
va: 1.3068 1.2514 2.1241 2.0914 2.1130 3.7204 3.8875 3.8468 3.9071 3.9058 3.9191 4.1726 4.1557 3.8621 3.6405 3.8844 3.9930 3.8510 3.8878 4.0416 3.8957 4.0186 3.9122 3.9391 3.9399 3.9761 1.0076 1.0360 1.0047 1.0078 1.0042 0.9983 1.0046 1.0161 1.0152 1.0134 0.9903 1.0190 1.0184 0.9985 1.0129 1.0144 1.0407 0.9995 1.0125 1.0012
dispcorr: -0.028117446 hartree
energy: -1958.449709990293
dipole: -6.94749 6.46295 -0.48453 14.73554 -13.47877 1.25677 -16.97459 16.79559 -0.17900
magnitude: 1.35878 au
magnitude: 3.45375 debye
