program: Orca
programVersion: 5.0.2
elementType: Cl Cl O O O C C C C C C C C C C C C C C C C C C C C C H H H H H H H H H H H H H H H H H H H H
charge: 0
multiplicity: 1
keywords: wb97x-d3
keywords: def2-TZVPP
keywords: def2/J RIJCOSX
keywords: DEFGRID2
keywords: scfconv7
keywords: smallprint printgap noloewdin
keywords: NOSOSCF
formula: C21H20Cl2O3
InChI: InChI=1/C21H20Cl2O3/c1-21(2)17(12-18(22)23)19(21)20(24)25-13-14-7-6-10-16(11-14)26-15-8-4-3-5-9-15/h3-12,17,19H,13H2,1-2H3
46 atoms
Cl -1.611813 -0.373295 0.960842
Cl -2.012076 -0.891614 -1.853595
O  0.930487 2.894631 0.966889
O  0.046377 2.913143 -1.084266
O  1.856451 -2.182951 1.443608
C  -2.553142 3.926807 0.207641
C  -2.582498 2.447812 0.395845
C  -1.353837 3.24631 0.82903
C  -3.38773 4.739892 1.171153
C  -2.501545 4.535216 -1.172671
C  -2.491297 1.496269 -0.729929
C  -0.084454 3.012404 0.105962
C  -2.099178 0.240843 -0.567699
C  2.195021 2.525732 0.414543
C  2.218816 1.094495 -0.043506
C  2.004328 0.076171 0.875315
C  2.441856 0.779372 -1.377442
C  2.028771 -1.249791 0.467391
C  2.474548 -0.546577 -1.775208
C  2.274077 -1.569872 -0.862383
C  1.414552 -3.438726 1.139538
C  2.120532 -4.509165 1.667572
C  0.267912 -3.652744 0.383992
C  1.673462 -5.802539 1.442973
C  -0.161869 -4.950814 0.159309
C  0.534961 -6.029715 0.68532
H  -3.1702 2.083855 1.233816
H  -1.237057 3.369379 1.899247
H  -4.411856 4.833838 0.806114
H  -3.430922 4.286371 2.162247
H  -2.980171 5.745571 1.284538
H  -3.516589 4.642597 -1.559789
H  -2.062042 5.532641 -1.127347
H  -1.921495 3.95939 -1.88657
H  -2.75653 1.817102 -1.728592
H  2.469391 3.196382 -0.402353
H  2.901182 2.681542 1.23034
H  1.816168 0.302344 1.917938
H  2.574389 1.570079 -2.103542
H  2.652539 -0.793571 -2.813293
H  2.308959 -2.600713 -1.188156
H  3.009883 -4.322985 2.254988
H  -0.286247 -2.816812 -0.022072
H  2.224259 -6.635848 1.858804
H  -1.056109 -5.116503 -0.42676
H  0.190087 -7.039417 0.508735
totalener: -1958.42205272 hartree
nucrepener: 2679.11637563 hartree
electener: -4637.53842835 hartree
oneelecener: -8012.19544150 hartree
twoeener: 3374.65701315 hartree
kineticenergy: 1952.64231852 hartree
xcener: -143.520269793543 hartree
chargesum: 0.0000000
charge: -0.047976 -0.047185 -0.265584 -0.383766 -0.294121 0.108831 -0.066574 -0.079342 -0.237273 -0.272494 -0.147982 0.347827 0.073577 0.063796 0.053447 -0.325061 -0.122439 0.286691 -0.121729 -0.167241 0.255351 -0.185675 -0.126655 -0.107025 -0.148160 -0.129406 0.101083 0.081048 0.089882 0.073732 0.092641 0.090765 0.087545 0.103432 0.110363 0.099915 0.111778 0.109495 0.105626 0.122600 0.129833 0.122450 0.079270 0.124096 0.126016 0.124596
qa: -0.0480 -0.0472 -0.2656 -0.3838 -0.2941 0.1088 -0.0666 -0.0793 -0.2373 -0.2725 -0.1480 0.3478 0.0736 0.0638 0.0534 -0.3251 -0.1224 0.2867 -0.1217 -0.1672 0.2554 -0.1857 -0.1267 -0.1070 -0.1482 -0.1294 0.1011 0.0810 0.0899 0.0737 0.0926 0.0908 0.0875 0.1034 0.1104 0.0999 0.1118 0.1095 0.1056 0.1226 0.1298 0.1224 0.0793 0.1241 0.1260 0.1246
va: 1.2830 1.2608 2.1302 2.0984 2.1071 3.7601 3.8825 3.8541 3.9020 3.8999 3.8950 4.1584 4.1919 3.8553 3.6350 4.0187 3.9816 3.7839 3.9797 3.9253 3.7454 4.0263 3.9111 3.9393 4.0063 3.9422 1.0118 1.0336 1.0048 1.0071 1.0047 0.9979 1.0046 1.0224 1.0188 1.0092 0.9911 1.0340 1.0196 1.0016 1.0048 1.0141 1.0537 0.9994 0.9993 1.0000
dispcorr: -0.027273179 hartree
energy: -1958.449325898369
dipole: 0.14625 -0.49923 -0.35298 16.18181 -15.63243 0.54939 1.65882 -1.47264 0.18618
magnitude: 0.67903 au
magnitude: 1.72595 debye
