program: Orca
programVersion: 5.0.2
elementType: Cl Cl O O O C C C C C C C C C C C C C C C C C C C C C H H H H H H H H H H H H H H H H H H H H
charge: 0
multiplicity: 1
keywords: wb97x-d3
keywords: def2-TZVPP
keywords: def2/J RIJCOSX
keywords: DEFGRID2
keywords: scfconv7
keywords: smallprint printgap noloewdin
keywords: NOSOSCF
formula: C21H20Cl2O3
InChI: InChI=1/C21H20Cl2O3/c1-21(2)17(12-18(22)23)19(21)20(24)25-13-14-7-6-10-16(11-14)26-15-8-4-3-5-9-15/h3-12,17,19H,13H2,1-2H3
46 atoms
Cl -3.970164 -0.938971 1.383506
Cl -3.575848 -1.688638 -1.370712
O  1.362911 2.592987 0.080882
O  -0.008588 1.813693 -1.511492
O  3.059682 -2.333567 0.200632
C  -2.208248 2.95648 0.429535
C  -2.106613 1.484807 0.710218
C  -0.847744 2.34082 0.674282
C  -2.73866 3.823415 1.546657
C  -2.611374 3.446371 -0.938962
C  -2.419239 0.478022 -0.31305
C  0.174853 2.207246 -0.387908
C  -3.212705 -0.566954 -0.119274
C  2.51925 2.455134 -0.749279
C  3.347338 1.288274 -0.29267
C  2.793608 0.011853 -0.284722
C  4.6571 1.473597 0.125181
C  3.543055 -1.063419 0.168332
C  5.412158 0.38513 0.541459
C  4.8604 -0.881968 0.576701
C  1.715096 -2.539844 0.357344
C  1.071466 -3.355791 -0.55855
C  1.020331 -1.99006 1.427888
C  -0.278988 -3.630223 -0.396813
C  -0.330538 -2.263246 1.5711
C  -0.984172 -3.085576 0.664467
H  -2.384116 1.194122 1.716767
H  -0.421641 2.547981 1.648714
H  -2.361546 4.843803 1.459475
H  -3.828512 3.865745 1.513168
H  -2.452715 3.446702 2.529427
H  -3.699524 3.451981 -1.018153
H  -2.264327 4.470064 -1.08882
H  -2.221921 2.847005 -1.75623
H  -1.992181 0.584835 -1.299999
H  2.227937 2.348078 -1.794929
H  3.08046 3.384132 -0.645055
H  1.783186 -0.146226 -0.641207
H  5.090572 2.465846 0.129823
H  6.435211 0.52963 0.862438
H  5.435632 -1.732305 0.918131
H  1.62904 -3.771573 -1.387396
H  1.530489 -1.355303 2.141287
H  -0.782809 -4.266155 -1.112288
H  -0.877737 -1.832635 2.39939
H  -2.037282 -3.297626 0.784794
totalener: -1958.42496802 hartree
nucrepener: 2647.69123805 hartree
electener: -4606.11620607 hartree
oneelecener: -7948.68891156 hartree
twoeener: 3342.57270549 hartree
kineticenergy: 1952.61615315 hartree
xcener: -143.517453788153 hartree
chargesum: 0.0000000
charge: -0.061061 -0.049066 -0.261580 -0.407553 -0.299199 0.073838 0.040827 -0.090539 -0.232030 -0.254959 -0.211343 0.362643 0.041377 0.062238 -0.004991 -0.149667 -0.196877 0.222034 -0.073694 -0.218312 0.238434 -0.192279 -0.169683 -0.093954 -0.123791 -0.122395 0.073890 0.089914 0.090308 0.092308 0.072952 0.093843 0.089654 0.101735 0.130563 0.120369 0.091449 0.144532 0.106438 0.124087 0.125639 0.123925 0.129072 0.124048 0.119023 0.127835
qa: -0.0611 -0.0491 -0.2616 -0.4076 -0.2992 0.0738 0.0408 -0.0905 -0.2320 -0.2550 -0.2113 0.3626 0.0414 0.0622 -0.0050 -0.1497 -0.1969 0.2220 -0.0737 -0.2183 0.2384 -0.1923 -0.1697 -0.0940 -0.1238 -0.1224 0.0739 0.0899 0.0903 0.0923 0.0730 0.0938 0.0897 0.1017 0.1306 0.1204 0.0914 0.1445 0.1064 0.1241 0.1256 0.1239 0.1291 0.1240 0.1190 0.1278
va: 1.2665 1.2590 2.1431 2.0675 2.1096 3.8049 3.7844 3.9086 3.9081 3.9179 3.8823 4.1546 4.2636 3.8531 3.8203 3.8732 4.0149 3.8561 3.9497 4.0442 3.8060 4.0550 3.9724 3.9645 3.8952 3.8963 1.0334 1.0306 1.0044 1.0041 1.0088 1.0020 1.0020 1.0184 1.0385 1.0145 1.0004 1.0173 1.0134 0.9991 1.0133 1.0128 1.0047 1.0035 1.0104 1.0171
dispcorr: -0.026700782 hartree
energy: -1958.451668805586
dipole: 13.38016 -13.15183 0.22832 22.11194 -20.97508 1.13685 3.21038 -2.68351 0.52687
magnitude: 1.27364 au
magnitude: 3.23734 debye
