program: Orca
programVersion: 5.0.2
elementType: Cl Cl O O O C C C C C C C C C C C C C C C C C C C C C H H H H H H H H H H H H H H H H H H H H
charge: 0
multiplicity: 1
keywords: wb97x-d3
keywords: def2-TZVPP
keywords: def2/J RIJCOSX
keywords: DEFGRID2
keywords: scfconv7
keywords: smallprint printgap noloewdin
keywords: NOSOSCF
formula: C21H20Cl2O3
InChI: InChI=1/C21H20Cl2O3/c1-21(2)17(12-18(22)23)19(21)20(24)25-13-14-7-6-10-16(11-14)26-15-8-4-3-5-9-15/h3-12,17,19H,13H2,1-2H3
46 atoms
Cl -0.935706 -0.080083 1.843978
Cl -2.972307 -1.62511 0.491743
O  0.86611 2.700959 -0.620724
O  -0.797977 1.468227 -1.484842
O  2.082983 -2.385238 0.830254
C  -2.625503 3.565935 -0.061001
C  -2.477639 2.400121 0.857005
C  -1.237849 3.046926 0.258515
C  -2.976114 4.896111 0.563669
C  -3.225631 3.37721 -1.432801
C  -2.935127 1.047993 0.47474
C  -0.406623 2.30531 -0.715076
C  -2.361118 -0.071212 0.888923
C  1.858555 2.003468 -1.379731
C  2.552169 0.998563 -0.505866
C  1.989244 -0.25865 -0.310278
C  3.724164 1.34258 0.156224
C  2.602246 -1.160239 0.550211
C  4.328264 0.435397 1.013149
C  3.774844 -0.817088 1.211996
C  1.351561 -3.051786 -0.112935
C  0.104278 -3.52976 0.253206
C  1.861841 -3.29798 -1.381652
C  -0.632492 -4.275823 -0.654466
C  1.110502 -4.034803 -2.282613
C  -0.135941 -4.528915 -1.923507
H  -2.589443 2.611833 1.917446
H  -0.662013 3.656161 0.944725
H  -4.058278 5.00299 0.657743
H  -2.546201 5.007945 1.559829
H  -2.612025 5.722055 -0.049339
H  -4.312851 3.458486 -1.373035
H  -2.877951 4.160181 -2.108426
H  -2.980349 2.420756 -1.885979
H  -3.815398 0.953392 -0.148963
H  1.413671 1.5325 -2.256494
H  2.559807 2.766497 -1.718092
H  1.069291 -0.522113 -0.817757
H  4.16171 2.321823 0.007416
H  5.24238 0.70187 1.526999
H  4.239538 -1.532631 1.877455
H  -0.281438 -3.314728 1.240484
H  2.838758 -2.922818 -1.658902
H  -1.605264 -4.652168 -0.367244
H  1.506497 -4.229141 -3.270614
H  -0.715708 -5.10695 -2.630223
totalener: -1958.42130641 hartree
nucrepener: 2693.23817506 hartree
electener: -4651.65948147 hartree
oneelecener: -8040.52763461 hartree
twoeener: 3388.86815314 hartree
kineticenergy: 1952.63330337 hartree
xcener: -143.517373893079 hartree
chargesum: -0.0000000
charge: -0.045197 -0.052131 -0.260641 -0.387323 -0.295944 0.107018 -0.048421 -0.093631 -0.236613 -0.283394 -0.158124 0.345795 0.080595 0.041035 0.008346 -0.183981 -0.195218 0.247653 -0.078735 -0.226786 0.256328 -0.224421 -0.151827 -0.091062 -0.115281 -0.136316 0.102619 0.083525 0.088074 0.073745 0.092386 0.089909 0.088526 0.110966 0.109293 0.116681 0.096885 0.145806 0.104767 0.123899 0.125357 0.125784 0.128009 0.124553 0.124559 0.122930
qa: -0.0452 -0.0521 -0.2606 -0.3873 -0.2959 0.1070 -0.0484 -0.0936 -0.2366 -0.2834 -0.1581 0.3458 0.0806 0.0410 0.0083 -0.1840 -0.1952 0.2477 -0.0787 -0.2268 0.2563 -0.2244 -0.1518 -0.0911 -0.1153 -0.1363 0.1026 0.0835 0.0881 0.0737 0.0924 0.0899 0.0885 0.1110 0.1093 0.1167 0.0969 0.1458 0.1048 0.1239 0.1254 0.1258 0.1280 0.1246 0.1246 0.1229
va: 1.2911 1.2588 2.1342 2.0863 2.0996 3.7278 3.8912 3.8655 3.9051 3.9081 3.8976 4.1549 4.1976 3.8635 3.7409 3.8402 4.0385 3.7840 3.9398 4.0596 3.7944 4.0107 3.9659 3.9254 3.9486 3.9776 1.0076 1.0351 1.0047 1.0078 1.0043 0.9980 1.0045 1.0153 1.0158 1.0170 0.9975 1.0192 1.0121 0.9988 1.0136 1.0258 1.0054 1.0006 1.0000 1.0004
dispcorr: -0.027108309 hartree
energy: -1958.448414716126
dipole: 1.07552 -1.19999 -0.12447 19.60718 -18.52494 1.08224 -11.15112 11.01511 -0.13602
magnitude: 1.09783 au
magnitude: 2.79047 debye
