program: Orca
programVersion: 5.0.2
elementType: Cl Cl O O O C C C C C C C C C C C C C C C C C C C C C H H H H H H H H H H H H H H H H H H H H
charge: 0
multiplicity: 1
keywords: wb97x-d3
keywords: def2-TZVPP
keywords: def2/J RIJCOSX
keywords: DEFGRID2
keywords: scfconv7
keywords: smallprint printgap noloewdin
keywords: NOSOSCF
formula: C21H20Cl2O3
InChI: InChI=1/C21H20Cl2O3/c1-21(2)17(12-18(22)23)19(21)20(24)25-13-14-7-6-10-16(11-14)26-15-8-4-3-5-9-15/h3-12,17,19H,13H2,1-2H3
46 atoms
Cl -3.969947 -0.938541 1.334241
Cl -3.54693 -1.690269 -1.415969
O  1.376189 2.601393 0.071552
O  0.013268 1.823565 -1.52856
O  3.053947 -2.327301 0.198686
C  -2.1982 2.948688 0.413501
C  -2.090005 1.475639 0.68456
C  -0.835056 2.337652 0.657139
C  -2.735769 3.804341 1.535816
C  -2.603134 3.443948 -0.952437
C  -2.396177 0.473861 -0.345569
C  0.190926 2.212757 -0.402526
C  -3.195821 -0.567862 -0.161352
C  2.536188 2.464783 -0.752622
C  3.358988 1.293075 -0.297932
C  2.798118 0.019717 -0.285699
C  4.671794 1.471156 0.113414
C  3.543614 -1.059358 0.164711
C  5.422324 0.378951 0.528064
C  4.863607 -0.884952 0.567573
C  1.708895 -2.528375 0.358957
C  1.059656 -3.34149 -0.555569
C  1.019198 -1.977687 1.432407
C  -0.290908 -3.612573 -0.389271
C  -0.331644 -2.248111 1.580507
C  -0.990628 -3.067943 0.675483
H  -2.36849 1.177597 1.688669
H  -0.411786 2.540357 1.63366
H  -2.447935 3.423316 2.516349
H  -2.365763 4.827926 1.455659
H  -3.825816 3.839214 1.501614
H  -2.282027 4.478185 -1.087062
H  -2.191176 2.864577 -1.773239
H  -3.690399 3.421939 -1.040847
H  -1.958783 0.581864 -1.327793
H  2.250951 2.364193 -1.800635
H  3.099542 3.391556 -0.640337
H  1.785491 -0.1341 -0.637493
H  5.111347 2.460758 0.114635
H  6.447589 0.518166 0.844294
H  5.435451 -1.738017 0.907841
H  1.613014 -3.758003 -1.386862
H  1.533867 -1.345361 2.144681
H  -0.799107 -4.246367 -1.103543
H  -0.874492 -1.817372 2.411579
H  -2.043663 -3.278158 0.799569
totalener: -1958.42494096 hartree
nucrepener: 2649.49719258 hartree
electener: -4607.92213354 hartree
oneelecener: -7952.29881487 hartree
twoeener: 3344.37668133 hartree
kineticenergy: 1952.61456492 hartree
xcener: -143.517309274214 hartree
chargesum: 0.0000000
charge: -0.061531 -0.049250 -0.261540 -0.407256 -0.299154 0.075892 0.039608 -0.091788 -0.232178 -0.255143 -0.213719 0.361192 0.045087 0.062995 -0.004565 -0.150875 -0.197365 0.223196 -0.073188 -0.219014 0.238180 -0.191573 -0.169293 -0.094068 -0.124297 -0.124595 0.074022 0.090042 0.072886 0.090239 0.092523 0.089074 0.101652 0.094459 0.131259 0.120091 0.091535 0.144646 0.106467 0.124099 0.125604 0.123900 0.129046 0.124030 0.119153 0.129515
qa: -0.0615 -0.0493 -0.2615 -0.4073 -0.2992 0.0759 0.0396 -0.0918 -0.2322 -0.2551 -0.2137 0.3612 0.0451 0.0630 -0.0046 -0.1509 -0.1974 0.2232 -0.0732 -0.2190 0.2382 -0.1916 -0.1693 -0.0941 -0.1243 -0.1246 0.0740 0.0900 0.0729 0.0902 0.0925 0.0891 0.1017 0.0945 0.1313 0.1201 0.0915 0.1446 0.1065 0.1241 0.1256 0.1239 0.1290 0.1240 0.1192 0.1295
va: 1.2661 1.2588 2.1430 2.0673 2.1096 3.8035 3.7841 3.9117 3.9081 3.9172 3.8827 4.1558 4.2632 3.8532 3.8218 3.8756 4.0148 3.8547 3.9495 4.0443 3.8067 4.0553 3.9718 3.9621 3.8942 3.8947 1.0332 1.0306 1.0088 1.0045 1.0040 1.0023 1.0186 1.0018 1.0383 1.0143 1.0003 1.0171 1.0134 0.9991 1.0133 1.0128 1.0047 1.0038 1.0103 1.0164
dispcorr: -0.026773655 hartree
energy: -1958.451714613369
dipole: 13.33161 -13.10391 0.22771 22.06350 -20.93279 1.13071 3.45979 -2.92431 0.53548
magnitude: 1.27165 au
magnitude: 3.23227 debye
