program: Orca
programVersion: 5.0.2
elementType: Cl Cl O O O C C C C C C C C C C C C C C C C C C C C C H H H H H H H H H H H H H H H H H H H H
charge: 0
multiplicity: 1
keywords: wb97x-d3
keywords: def2-TZVPP
keywords: def2/J RIJCOSX
keywords: DEFGRID2
keywords: scfconv7
keywords: smallprint printgap noloewdin
keywords: NOSOSCF
formula: C21H20Cl2O3
InChI: InChI=1/C21H20Cl2O3/c1-21(2)17(12-18(22)23)19(21)20(24)25-13-14-7-6-10-16(11-14)26-15-8-4-3-5-9-15/h3-12,17,19H,13H2,1-2H3
46 atoms
Cl -5.979187 1.77569 -0.509001
Cl -5.267948 2.318838 -3.24816
O  0.489588 1.139342 -0.159158
O  -0.49661 2.369027 -1.737004
O  2.597206 -3.124656 1.516689
C  -2.115969 3.490517 0.70648
C  -2.97364 2.41182 0.111989
C  -1.510921 2.129791 0.430311
C  -2.345348 3.809036 2.165305
C  -1.731265 4.700951 -0.108089
C  -3.482912 2.47732 -1.264899
C  -0.490813 1.916146 -0.621025
C  -4.737816 2.223658 -1.614971
C  1.561707 0.849131 -1.055637
C  2.554831 -0.01185 -0.334564
C  2.150641 -1.20073 0.262262
C  3.893781 0.352056 -0.294391
C  3.077273 -2.008136 0.902809
C  4.81683 -0.466002 0.341026
C  4.419832 -1.644511 0.9477
C  3.363115 -4.252347 1.592983
C  4.056721 -4.748937 0.495664
C  3.381986 -4.929918 2.803151
C  4.778491 -5.925094 0.624538
C  4.099521 -6.111088 2.914905
C  4.805158 -6.61064 1.830742
H  -3.651268 1.934817 0.810744
H  -1.352959 1.512127 1.306614
H  -1.439755 4.213454 2.620666
H  -3.13636 4.552392 2.275966
H  -2.637809 2.927505 2.736801
H  -1.548734 4.489134 -1.156977
H  -2.527152 5.444931 -0.050365
H  -0.825587 5.154971 0.297841
H  -2.801483 2.744471 -2.060311
H  1.172793 0.337977 -1.940889
H  2.030939 1.774229 -1.398365
H  1.111758 -1.506306 0.243093
H  4.218134 1.277064 -0.754262
H  5.858566 -0.176278 0.376478
H  5.144326 -2.267597 1.455343
H  4.031624 -4.225067 -0.451372
H  2.831296 -4.531495 3.645125
H  5.317915 -6.311442 -0.230181
H  4.110174 -6.639017 3.859328
H  5.367738 -7.529711 1.922488
totalener: -1958.42577577 hartree
nucrepener: 2364.25817219 hartree
electener: -4322.68394796 hartree
oneelecener: -7381.59065199 hartree
twoeener: 3058.90670402 hartree
kineticenergy: 1952.60488564 hartree
xcener: -143.511476525499 hartree
chargesum: 0.0000000
charge: -0.053234 -0.046670 -0.262266 -0.400122 -0.297423 0.064524 0.051400 -0.075182 -0.232166 -0.252117 -0.229585 0.348439 0.040015 0.062700 0.039593 -0.221763 -0.160492 0.222089 -0.117031 -0.162515 0.239274 -0.165083 -0.204425 -0.115471 -0.093974 -0.141771 0.076492 0.088312 0.089919 0.091908 0.073816 0.102362 0.093428 0.088320 0.133364 0.109696 0.091653 0.114031 0.110913 0.127028 0.133406 0.133506 0.125849 0.127685 0.125596 0.125973
qa: -0.0532 -0.0467 -0.2623 -0.4001 -0.2974 0.0645 0.0514 -0.0752 -0.2322 -0.2521 -0.2296 0.3484 0.0400 0.0627 0.0396 -0.2218 -0.1605 0.2221 -0.1170 -0.1625 0.2393 -0.1651 -0.2044 -0.1155 -0.0940 -0.1418 0.0765 0.0883 0.0899 0.0919 0.0738 0.1024 0.0934 0.0883 0.1334 0.1097 0.0917 0.1140 0.1109 0.1270 0.1334 0.1335 0.1258 0.1277 0.1256 0.1260
va: 1.2750 1.2599 2.1463 2.0882 2.1083 3.7830 3.7843 3.9086 3.9140 3.9110 3.8894 4.1424 4.2452 3.8295 3.7581 4.0595 3.9899 3.8653 3.9760 3.9396 3.8104 3.9485 4.0366 3.9438 3.9347 3.9588 1.0353 1.0271 1.0042 1.0041 1.0087 1.0188 1.0022 1.0018 1.0365 0.9955 1.0088 1.0328 1.0121 1.0015 1.0034 1.0035 1.0136 0.9997 0.9989 1.0003
dispcorr: -0.020549712 hartree
energy: -1958.446325482063
dipole: 35.28696 -34.00276 1.28421 -2.17107 1.99807 -0.17300 17.52466 -16.63767 0.88698
magnitude: 1.57030 au
magnitude: 3.99140 debye
