program: Orca
programVersion: 5.0.2
elementType: Cl Cl O O O C C C C C C C C C C C C C C C C C C C C C H H H H H H H H H H H H H H H H H H H H
charge: 0
multiplicity: 1
keywords: wb97x-d3
keywords: def2-TZVPP
keywords: def2/J RIJCOSX
keywords: DEFGRID2
keywords: scfconv7
keywords: smallprint printgap noloewdin
keywords: NOSOSCF
formula: C21H20Cl2O3
InChI: InChI=1/C21H20Cl2O3/c1-21(2)17(12-18(22)23)19(21)20(24)25-13-14-7-6-10-16(11-14)26-15-8-4-3-5-9-15/h3-12,17,19H,13H2,1-2H3
46 atoms
Cl -5.300691 3.071257 1.864238
Cl -6.110148 0.992827 0.040511
O  0.471855 1.120291 -0.178963
O  -1.314145 0.858465 -1.489886
O  4.471396 -3.083561 1.070067
C  -1.859197 3.85351 -0.777489
C  -2.619005 3.070346 0.251788
C  -1.152362 2.752052 -0.016767
C  -1.459951 5.259335 -0.395209
C  -2.188016 3.716267 -2.243757
C  -3.703306 2.147052 -0.106467
C  -0.718082 1.489871 -0.655952
C  -4.87277 2.08598 0.518745
C  1.051039 -0.062852 -0.718119
C  2.384834 -0.285921 -0.0664
C  2.787321 -1.58854 0.198787
C  3.236721 0.772237 0.231203
C  4.042222 -1.833924 0.7439
C  4.477673 0.517215 0.792122
C  4.892389 -0.780141 1.044471
C  4.104279 -4.165923 0.324151
C  4.114544 -4.147966 -1.065528
C  3.775588 -5.326233 1.009957
C  3.783898 -5.300056 -1.761851
C  3.458957 -6.474351 0.300453
C  3.455164 -6.466324 -1.086182
H  -2.767644 3.582692 1.195131
H  -0.475413 3.088776 0.759677
H  -2.263996 5.960631 -0.623759
H  -1.235722 5.348792 0.66837
H  -0.574149 5.575058 -0.94914
H  -1.32938 4.007794 -2.850935
H  -2.473276 2.713088 -2.543685
H  -3.011021 4.387579 -2.493312
H  -3.557036 1.465964 -0.933129
H  0.392576 -0.919062 -0.551827
H  1.16837 0.045119 -1.800864
H  2.11612 -2.413137 -0.010547
H  2.934072 1.791778 0.036172
H  5.138087 1.340349 1.030685
H  5.862213 -0.982125 1.479337
H  4.383241 -3.246432 -1.600951
H  3.77674 -5.324045 2.091947
H  3.791915 -5.284726 -2.843687
H  3.206389 -7.378275 0.838774
H  3.201392 -7.362012 -1.636531
totalener: -1958.42537755 hartree
nucrepener: 2374.02320290 hartree
electener: -4332.44858044 hartree
oneelecener: -7401.01663298 hartree
twoeener: 3068.56805254 hartree
kineticenergy: 1952.60792843 hartree
xcener: -143.513629345337 hartree
chargesum: -0.0000000
charge: -0.052396 -0.045780 -0.267428 -0.397895 -0.297034 0.069565 0.050881 -0.079217 -0.232463 -0.250482 -0.231655 0.347560 0.040553 0.069997 0.063652 -0.201705 -0.201304 0.233992 -0.085384 -0.210558 0.254604 -0.177090 -0.214944 -0.110410 -0.087735 -0.147457 0.076443 0.087266 0.092591 0.073896 0.089004 0.087497 0.103101 0.092568 0.132278 0.097731 0.103667 0.121546 0.113312 0.124409 0.125668 0.132887 0.125827 0.127977 0.126186 0.126279
qa: -0.0524 -0.0458 -0.2674 -0.3979 -0.2970 0.0696 0.0509 -0.0792 -0.2325 -0.2505 -0.2317 0.3476 0.0406 0.0700 0.0637 -0.2017 -0.2013 0.2340 -0.0854 -0.2106 0.2546 -0.1771 -0.2149 -0.1104 -0.0877 -0.1475 0.0764 0.0873 0.0926 0.0739 0.0890 0.0875 0.1031 0.0926 0.1323 0.0977 0.1037 0.1215 0.1133 0.1244 0.1257 0.1329 0.1258 0.1280 0.1262 0.1263
va: 1.2760 1.2611 2.1472 2.0918 2.1135 3.7685 3.7965 3.9072 3.9137 3.9116 3.8960 4.1457 4.2475 3.8324 3.7145 3.9622 4.0173 3.8661 3.9422 4.0412 3.8025 3.9513 4.0429 3.9427 3.9300 3.9666 1.0361 1.0272 1.0042 1.0084 1.0043 1.0018 1.0194 1.0020 1.0356 1.0072 0.9946 1.0135 1.0236 0.9997 1.0134 1.0037 1.0141 0.9996 0.9987 1.0004
dispcorr: -0.020661695 hartree
energy: -1958.446039241102
dipole: 32.68142 -31.69603 0.98539 0.38611 0.05927 0.44539 -12.86022 12.59097 -0.26925
magnitude: 1.11439 au
magnitude: 2.83256 debye
