program: Orca
programVersion: 5.0.2
elementType: Cl Cl O O O C C C C C C C C C C C C C C C C C C C C C H H H H H H H H H H H H H H H H H H H H
charge: 0
multiplicity: 1
keywords: wb97x-d3
keywords: def2-TZVPP
keywords: def2/J RIJCOSX
keywords: DEFGRID2
keywords: scfconv7
keywords: smallprint printgap noloewdin
keywords: NOSOSCF
formula: C21H20Cl2O3
InChI: InChI=1/C21H20Cl2O3/c1-21(2)17(12-18(22)23)19(21)20(24)25-13-14-7-6-10-16(11-14)26-15-8-4-3-5-9-15/h3-12,17,19H,13H2,1-2H3
46 atoms
Cl -3.859657 -0.99405 -1.025909
Cl -1.835271 -1.206768 -3.074577
O  1.138083 2.466266 1.308789
O  0.508855 2.703828 -0.819486
O  2.584623 -2.336849 0.317737
C  -2.401012 2.692983 0.238662
C  -2.056484 1.233902 0.173201
C  -1.120035 2.210858 0.875989
C  -3.490894 3.08699 1.208164
C  -2.405389 3.523564 -1.020795
C  -1.669182 0.570003 -1.082012
C  0.226274 2.493884 0.330235
C  -2.367125 -0.4035 -1.651232
C  2.502033 2.546403 0.907644
C  2.957881 1.309632 0.181985
C  2.523323 0.058566 0.606344
C  3.836165 1.411242 -0.885827
C  2.960999 -1.082708 -0.050921
C  4.287299 0.262154 -1.519528
C  3.850849 -0.985943 -1.114521
C  1.425926 -2.501049 1.028423
C  0.195865 -2.25771 0.432206
C  1.504168 -2.954367 2.335153
C  -0.963746 -2.473886 1.159211
C  0.335875 -3.174004 3.051248
C  -0.898366 -2.930556 2.468779
H  -2.602964 0.597053 0.860472
H  -1.135839 2.135109 1.956818
H  -3.497249 2.458979 2.100027
H  -3.36413 4.121473 1.531496
H  -4.471317 3.002522 0.736975
H  -2.240195 4.575457 -0.783171
H  -1.654027 3.22773 -1.745247
H  -3.382893 3.441233 -1.498572
H  -0.758155 0.872547 -1.581741
H  2.676668 3.434426 0.296087
H  3.052744 2.668046 1.841358
H  1.84232 -0.024988 1.444082
H  4.157051 2.38489 -1.233548
H  4.970087 0.340705 -2.355112
H  4.185035 -1.884466 -1.615967
H  0.146243 -1.91616 -0.593964
H  2.472676 -3.139811 2.780743
H  -1.924066 -2.295645 0.69402
H  0.394702 -3.532462 4.070399
H  -1.807367 -3.103369 3.029113
totalener: -1958.42442408 hartree
nucrepener: 2677.73095184 hartree
electener: -4636.15537592 hartree
oneelecener: -8008.69210101 hartree
twoeener: 3372.53672509 hartree
kineticenergy: 1952.62548915 hartree
xcener: -143.517820010513 hartree
chargesum: -0.0000000
charge: -0.055417 -0.042939 -0.276373 -0.383763 -0.300581 0.108834 0.009828 -0.073660 -0.236610 -0.249486 -0.244800 0.325197 0.042366 0.070873 0.047227 -0.220369 -0.180371 0.246907 -0.078905 -0.215679 0.210368 -0.137768 -0.179724 -0.119330 -0.106744 -0.144415 0.078998 0.089043 0.073310 0.092529 0.091734 0.088603 0.107848 0.087469 0.148461 0.102449 0.107331 0.124032 0.102038 0.122828 0.124016 0.130119 0.125749 0.137399 0.125559 0.125815
qa: -0.0554 -0.0429 -0.2764 -0.3838 -0.3006 0.1088 0.0098 -0.0737 -0.2366 -0.2495 -0.2448 0.3252 0.0424 0.0709 0.0472 -0.2204 -0.1804 0.2469 -0.0789 -0.2157 0.2104 -0.1378 -0.1797 -0.1193 -0.1067 -0.1444 0.0790 0.0890 0.0733 0.0925 0.0917 0.0886 0.1078 0.0875 0.1485 0.1024 0.1073 0.1240 0.1020 0.1228 0.1240 0.1301 0.1257 0.1374 0.1256 0.1258
va: 1.2727 1.2619 2.1251 2.0950 2.1125 3.8050 3.8289 3.9188 3.9058 3.9102 3.7991 4.1706 4.1868 3.8581 3.7072 3.8985 4.0340 3.8203 3.9510 4.0444 3.8990 3.9678 4.0177 3.8751 3.9348 3.9882 1.0242 1.0292 1.0083 1.0040 1.0055 1.0032 1.0184 1.0027 1.0268 1.0100 0.9878 1.0280 1.0132 0.9992 1.0140 1.0114 1.0113 1.0181 0.9989 1.0012
dispcorr: -0.027276681 hartree
energy: -1958.451700764653
dipole: 6.02917 -6.17013 -0.14095 18.60692 -17.90866 0.69826 16.08408 -15.07885 1.00523
magnitude: 1.23204 au
magnitude: 3.13159 debye
