program: Orca
programVersion: 5.0.2
elementType: Cl Cl O O O C C C C C C C C C C C C C C C C C C C C C H H H H H H H H H H H H H H H H H H H H
charge: 0
multiplicity: 1
keywords: wb97x-d3
keywords: def2-TZVPP
keywords: def2/J RIJCOSX
keywords: DEFGRID2
keywords: scfconv7
keywords: smallprint printgap noloewdin
keywords: NOSOSCF
formula: C21H20Cl2O3
InChI: InChI=1/C21H20Cl2O3/c1-21(2)17(12-18(22)23)19(21)20(24)25-13-14-7-6-10-16(11-14)26-15-8-4-3-5-9-15/h3-12,17,19H,13H2,1-2H3
46 atoms
Cl -5.03683 4.189968 -1.394675
Cl -3.158874 5.916979 -0.051664
O  0.295608 0.594505 -1.696826
O  0.007333 2.014773 0.005391
O  3.260094 -3.632704 -0.42855
C  -2.832928 0.736714 0.173974
C  -2.995899 1.91157 -0.744276
C  -1.877086 0.903836 -0.986747
C  -3.841679 -0.377325 0.019888
C  -2.386131 0.930126 1.60189
C  -2.728245 3.292497 -0.32184
C  -0.449167 1.250922 -0.806384
C  -3.536855 4.317987 -0.558748
C  1.71308 0.781861 -1.648161
C  2.355709 -0.130581 -0.643041
C  2.50424 -1.47916 -0.943717
C  2.78991 0.349827 0.58625
C  3.09853 -2.33929 -0.03245
C  3.386565 -0.515519 1.490402
C  3.550406 -1.858599 1.191582
C  3.280046 -4.637079 0.496084
C  2.292437 -4.75844 1.466219
C  4.294156 -5.578193 0.40214
C  2.333582 -5.827483 2.347014
C  4.317826 -6.648507 1.283637
C  3.343293 -6.775664 2.261716
H  -3.803394 1.819116 -1.461312
H  -2.050191 0.239381 -1.82501
H  -4.165962 -0.498252 -1.014325
H  -3.421279 -1.328902 0.349665
H  -4.728482 -0.175841 0.622977
H  -1.664671 1.729363 1.73707
H  -3.254224 1.152691 2.22429
H  -1.93355 0.012815 1.981559
H  -1.813687 3.507688 0.212983
H  2.055533 0.54426 -2.655082
H  1.957382 1.824949 -1.443144
H  2.16811 -1.87205 -1.895993
H  2.656975 1.393763 0.835565
H  3.73671 -0.140871 2.443058
H  4.031255 -2.518276 1.901882
H  1.49712 -4.026828 1.530841
H  5.053138 -5.470308 -0.361489
H  1.563696 -5.922513 3.101269
H  5.108677 -7.382823 1.20667
H  3.366574 -7.609593 2.949873
totalener: -1958.42593857 hartree
nucrepener: 2415.35950700 hartree
electener: -4373.78544557 hartree
oneelecener: -7483.91968896 hartree
twoeener: 3110.13424339 hartree
kineticenergy: 1952.61548323 hartree
xcener: -143.513745582848 hartree
chargesum: -0.0000000
charge: -0.053264 -0.046840 -0.264189 -0.414374 -0.297727 0.070812 0.050745 -0.105945 -0.233928 -0.249095 -0.234086 0.393495 0.040361 0.056717 -0.011263 -0.231823 -0.118852 0.230748 -0.124263 -0.159713 0.233151 -0.163659 -0.198384 -0.114669 -0.096347 -0.139426 0.076788 0.087052 0.073506 0.089958 0.091599 0.102642 0.091199 0.088667 0.133809 0.110386 0.107362 0.110837 0.120881 0.126976 0.133176 0.132839 0.125221 0.126867 0.125753 0.126304
qa: -0.0533 -0.0468 -0.2642 -0.4144 -0.2977 0.0708 0.0507 -0.1059 -0.2339 -0.2491 -0.2341 0.3935 0.0404 0.0567 -0.0113 -0.2318 -0.1189 0.2307 -0.1243 -0.1597 0.2332 -0.1637 -0.1984 -0.1147 -0.0963 -0.1394 0.0768 0.0871 0.0735 0.0900 0.0916 0.1026 0.0912 0.0887 0.1338 0.1104 0.1074 0.1108 0.1209 0.1270 0.1332 0.1328 0.1252 0.1269 0.1258 0.1263
va: 1.2751 1.2599 2.1435 2.0703 2.1050 3.7678 3.7853 3.9079 3.9133 3.9126 3.8951 4.1213 4.2442 3.8476 3.7026 4.0776 3.9524 3.8611 3.9729 3.9272 3.8168 3.9558 4.0366 3.9444 3.9341 3.9578 1.0348 1.0300 1.0090 1.0041 1.0042 1.0196 1.0017 1.0021 1.0364 0.9947 1.0122 1.0259 1.0221 1.0012 1.0042 1.0033 1.0134 0.9999 0.9991 1.0001
dispcorr: -0.021475975 hartree
energy: -1958.447414544853
dipole: 17.16794 -16.87388 0.29406 -36.74699 35.46891 -1.27808 11.49857 -11.26260 0.23597
magnitude: 1.33254 au
magnitude: 3.38704 debye
