program: Orca
programVersion: 5.0.2
elementType: Cl Cl O O O C C C C C C C C C C C C C C C C C C C C C H H H H H H H H H H H H H H H H H H H H
charge: 0
multiplicity: 1
keywords: wb97x-d3
keywords: def2-TZVPP
keywords: def2/J RIJCOSX
keywords: DEFGRID2
keywords: scfconv7
keywords: smallprint printgap noloewdin
keywords: NOSOSCF
formula: C21H20Cl2O3
InChI: InChI=1/C21H20Cl2O3/c1-21(2)17(12-18(22)23)19(21)20(24)25-13-14-7-6-10-16(11-14)26-15-8-4-3-5-9-15/h3-12,17,19H,13H2,1-2H3
46 atoms
Cl -1.886599 -0.554812 1.735909
Cl -1.979925 -1.551151 -0.967064
O  1.209183 3.196645 0.451701
O  0.166089 2.667474 -1.45585
O  1.336948 -1.731781 1.099565
C  -2.443821 3.624942 -0.088484
C  -2.228758 2.250467 0.459092
C  -1.094942 3.28263 0.493736
C  -3.282247 4.550814 0.764086
C  -2.640453 3.861587 -1.565951
C  -2.14468 1.05782 -0.398988
C  0.119515 3.022871 -0.310095
C  -2.024523 -0.18131 0.062337
C  2.464469 2.856802 -0.107907
C  2.766756 1.380525 -0.062142
C  1.892429 0.455076 0.485504
C  3.98059 0.944104 -0.584357
C  2.228212 -0.892091 0.504343
C  4.313855 -0.39876 -0.546203
C  3.444212 -1.330292 0.00007
C  1.009066 -2.931805 0.546364
C  0.540213 -3.901514 1.422803
C  1.065231 -3.187841 -0.818066
C  0.126754 -5.128583 0.932074
C  0.656502 -4.424867 -1.292925
C  0.186857 -5.40057 -0.426991
H  -2.652823 2.062006 1.439265
H  -0.886329 3.689354 1.476304
H  -3.136764 4.373363 1.830424
H  -3.032821 5.594182 0.564638
H  -4.342959 4.413247 0.548383
H  -2.402623 4.897624 -1.811322
H  -2.024962 3.234363 -2.202348
H  -3.687265 3.695264 -1.825964
H  -2.192061 1.174352 -1.47283
H  2.542261 3.218166 -1.136365
H  3.196244 3.399656 0.492431
H  0.943412 0.746896 0.915125
H  4.670964 1.656633 -1.020188
H  5.264392 -0.728746 -0.943991
H  3.71132 -2.37841 0.03254
H  0.493728 -3.681982 2.481257
H  1.40321 -2.428489 -1.51039
H  -0.241642 -5.87822 1.619913
H  0.698078 -4.619234 -2.356668
H  -0.133395 -6.360966 -0.807295
totalener: -1958.42157749 hartree
nucrepener: 2690.25950625 hartree
electener: -4648.68108373 hartree
oneelecener: -8034.39060552 hartree
twoeener: 3385.70952179 hartree
kineticenergy: 1952.62257496 hartree
xcener: -143.520368784930 hartree
chargesum: -0.0000000
charge: -0.052582 -0.036041 -0.274323 -0.372210 -0.287502 0.108222 -0.029599 -0.068897 -0.234642 -0.271183 -0.159476 0.304341 0.037947 0.044649 0.059438 -0.167884 -0.198587 0.236657 -0.098270 -0.188375 0.301976 -0.240534 -0.239308 -0.069150 -0.089769 -0.158873 0.085970 0.085668 0.074002 0.091227 0.092469 0.086561 0.103010 0.094510 0.117265 0.112997 0.118113 0.094654 0.108043 0.124788 0.132026 0.118026 0.134379 0.122144 0.126146 0.121976
qa: -0.0526 -0.0360 -0.2743 -0.3722 -0.2875 0.1082 -0.0296 -0.0689 -0.2346 -0.2712 -0.1595 0.3043 0.0379 0.0446 0.0594 -0.1679 -0.1986 0.2367 -0.0983 -0.1884 0.3020 -0.2405 -0.2393 -0.0692 -0.0898 -0.1589 0.0860 0.0857 0.0740 0.0912 0.0925 0.0866 0.1030 0.0945 0.1173 0.1130 0.1181 0.0947 0.1080 0.1248 0.1320 0.1180 0.1344 0.1221 0.1261 0.1220
va: 1.2722 1.2712 2.1291 2.1049 2.0834 3.7872 3.8520 3.8513 3.8976 3.9023 3.8678 4.1860 4.2123 3.8712 3.7107 4.0462 4.0163 3.8564 3.9471 3.9753 3.6738 4.0711 3.9327 3.9159 3.9136 3.9812 1.0252 1.0322 1.0075 1.0050 1.0041 1.0036 1.0242 0.9986 1.0285 1.0088 0.9863 1.0353 1.0090 1.0004 1.0063 1.0190 1.0117 0.9988 0.9982 1.0010
dispcorr: -0.027209390 hartree
energy: -1958.448786874807
dipole: 3.04504 -2.98281 0.06222 17.89969 -17.09427 0.80542 -5.25946 5.35826 0.09881
magnitude: 0.81384 au
magnitude: 2.06863 debye
