program: Orca
programVersion: 5.0.2
elementType: Cl Cl O O O C C C C C C C C C C C C C C C C C C C C C H H H H H H H H H H H H H H H H H H H H
charge: 0
multiplicity: 1
keywords: wb97x-d3
keywords: def2-TZVPP
keywords: def2/J RIJCOSX
keywords: DEFGRID2
keywords: scfconv7
keywords: smallprint printgap noloewdin
keywords: NOSOSCF
formula: C21H20Cl2O3
InChI: InChI=1/C21H20Cl2O3/c1-21(2)17(12-18(22)23)19(21)20(24)25-13-14-7-6-10-16(11-14)26-15-8-4-3-5-9-15/h3-12,17,19H,13H2,1-2H3
46 atoms
Cl -5.124729 4.148071 -1.503698
Cl -3.144638 5.995714 -0.515706
O  0.146956 0.404868 -1.629903
O  -0.019202 2.071006 -0.147723
O  3.393043 -3.699801 -0.334282
C  -2.86816 0.905471 0.366161
C  -3.060777 1.932878 -0.710077
C  -1.975618 0.872164 -0.856065
C  -3.902573 -0.192701 0.440974
C  -2.342309 1.308102 1.721511
C  -2.748907 3.352736 -0.498257
C  -0.533551 1.204991 -0.809055
C  -3.565955 4.353287 -0.802137
C  1.568503 0.562313 -1.700033
C  2.264143 -0.272502 -0.663291
C  2.50198 -1.616987 -0.919869
C  2.655753 0.272442 0.554505
C  3.139783 -2.409901 0.02267
C  3.290934 -0.527198 1.492061
C  3.542158 -1.866187 1.236974
C  3.425107 -4.684629 0.610359
C  2.432006 -4.812384 1.574132
C  4.461205 -5.604347 0.541669
C  2.490158 -5.865103 2.473623
C  4.501494 -6.658392 1.441653
C  3.521529 -6.791378 2.413654
H  -3.908542 1.757285 -1.36215
H  -2.209358 0.094539 -1.573568
H  -4.750588 0.122971 1.050684
H  -4.2862 -0.464089 -0.54323
H  -3.481125 -1.092378 0.892524
H  -1.89335 0.448714 2.221882
H  -1.594832 2.094183 1.689792
H  -3.169859 1.657231 2.340943
H  -1.796164 3.618185 -0.061647
H  1.83509 0.226546 -2.701813
H  1.843702 1.613528 -1.608165
H  2.202935 -2.058801 -1.862975
H  2.461899 1.314868 0.767116
H  3.605408 -0.102562 2.436227
H  4.053235 -2.473417 1.97256
H  1.618699 -4.099378 1.619526
H  5.22431 -5.492516 -0.217306
H  1.715628 -5.964789 3.222491
H  5.309829 -7.375316 1.384114
H  3.557774 -7.612512 3.116484
totalener: -1958.42593520 hartree
nucrepener: 2406.43274706 hartree
electener: -4364.85868226 hartree
oneelecener: -7466.02814963 hartree
twoeener: 3101.16946737 hartree
kineticenergy: 1952.61192093 hartree
xcener: -143.513195383185 hartree
chargesum: 0.0000000
charge: -0.052972 -0.046798 -0.262223 -0.418095 -0.298142 0.072401 0.052342 -0.109408 -0.232508 -0.251897 -0.234337 0.396466 0.038667 0.055137 -0.006565 -0.228224 -0.128920 0.227426 -0.121581 -0.161315 0.240616 -0.167633 -0.203610 -0.113807 -0.093510 -0.142117 0.076909 0.087304 0.092119 0.073160 0.089611 0.088472 0.102817 0.092427 0.134678 0.105772 0.111335 0.110552 0.127220 0.128124 0.133574 0.132954 0.124922 0.126688 0.125864 0.126108
qa: -0.0530 -0.0468 -0.2622 -0.4181 -0.2981 0.0724 0.0523 -0.1094 -0.2325 -0.2519 -0.2343 0.3965 0.0387 0.0551 -0.0066 -0.2282 -0.1289 0.2274 -0.1216 -0.1613 0.2406 -0.1676 -0.2036 -0.1138 -0.0935 -0.1421 0.0769 0.0873 0.0921 0.0732 0.0896 0.0885 0.1028 0.0924 0.1347 0.1058 0.1113 0.1106 0.1272 0.1281 0.1336 0.1330 0.1249 0.1267 0.1259 0.1261
va: 1.2753 1.2600 2.1468 2.0646 2.1060 3.7654 3.7815 3.9166 3.9125 3.9125 3.8887 4.1179 4.2452 3.8425 3.7077 4.0911 3.9487 3.8685 3.9696 3.9369 3.8100 3.9528 4.0380 3.9447 3.9334 3.9601 1.0341 1.0299 1.0041 1.0089 1.0043 1.0022 1.0193 1.0019 1.0362 0.9968 1.0125 1.0244 1.0225 1.0009 1.0038 1.0035 1.0138 0.9999 0.9989 1.0002
dispcorr: -0.021407965 hartree
energy: -1958.447343164316
dipole: 17.29098 -17.04084 0.25013 -35.84014 34.55413 -1.28600 14.55848 -14.18414 0.37434
magnitude: 1.36253 au
magnitude: 3.46328 debye
