program: Orca
programVersion: 5.0.2
elementType: Cl Cl O O O C C C C C C C C C C C C C C C C C C C C C H H H H H H H H H H H H H H H H H H H H
charge: 0
multiplicity: 1
keywords: wb97x-d3
keywords: def2-TZVPP
keywords: def2/J RIJCOSX
keywords: DEFGRID2
keywords: scfconv7
keywords: smallprint printgap noloewdin
keywords: NOSOSCF
formula: C21H20Cl2O3
InChI: InChI=1/C21H20Cl2O3/c1-21(2)17(12-18(22)23)19(21)20(24)25-13-14-7-6-10-16(11-14)26-15-8-4-3-5-9-15/h3-12,17,19H,13H2,1-2H3
46 atoms
Cl -5.210257 4.145265 -0.833906
Cl -2.99068 5.976827 -0.6541
O  -0.202772 0.077485 -1.73502
O  0.028564 1.93419 -0.512963
O  2.957057 -3.827888 0.01324
C  -2.665222 1.021401 0.782881
C  -3.06763 1.919495 -0.349906
C  -2.079595 0.784626 -0.592866
C  -3.688308 0.005431 1.23403
C  -1.825965 1.554256 1.917667
C  -2.672523 3.333725 -0.406093
C  -0.653617 1.025196 -0.911637
C  -3.515719 4.339407 -0.604927
C  1.175876 0.126557 -2.114381
C  2.063027 -0.489668 -1.070611
C  2.112314 -1.872908 -0.952065
C  2.823609 0.299671 -0.216393
C  2.926511 -2.466537 0.001157
C  3.638233 -0.301107 0.730568
C  3.701434 -1.680749 0.846503
C  3.261893 -4.49374 1.166395
C  2.568202 -4.25518 2.34639
C  4.252156 -5.462246 1.113478
C  2.878866 -4.993375 3.4770
C  4.546501 -6.201416 2.249828
C  3.866589 -5.967682 3.435008
H  -4.048322 1.716799 -0.764865
H  -2.496138 -0.059873 -1.129017
H  -4.292029 -0.366394 0.40528
H  -3.203296 -0.852513 1.702757
H  -4.367422 0.446529 1.965501
H  -2.477256 2.013938 2.662787
H  -1.288526 0.73911 2.404576
H  -1.091795 2.294033 1.615471
H  -1.630621 3.590893 -0.275134
H  1.223397 -0.445343 -3.04079
H  1.479088 1.151694 -2.331636
H  1.524462 -2.503774 -1.608281
H  2.773565 1.377394 -0.28864
H  4.239793 0.311253 1.38923
H  4.352286 -2.134579 1.582176
H  1.791351 -3.501912 2.379167
H  4.77954 -5.6356 0.184683
H  2.338396 -4.809586 4.39607
H  5.316788 -6.95998 2.206262
H  4.101044 -6.543265 4.320054
totalener: -1958.42569232 hartree
nucrepener: 2417.75589425 hartree
electener: -4376.18158656 hartree
oneelecener: -7488.73463718 hartree
twoeener: 3112.55305062 hartree
kineticenergy: 1952.61474407 hartree
xcener: -143.513283240471 hartree
chargesum: -0.0000000
charge: -0.052824 -0.046963 -0.264442 -0.414514 -0.297786 0.074638 0.045821 -0.109741 -0.233320 -0.248887 -0.232040 0.393408 0.039196 0.056602 -0.012410 -0.229019 -0.117916 0.227695 -0.127237 -0.156922 0.225542 -0.159006 -0.193299 -0.116448 -0.099993 -0.135938 0.078587 0.087297 0.073713 0.089183 0.092239 0.091908 0.089111 0.101733 0.134857 0.110278 0.108017 0.110052 0.120441 0.126695 0.132645 0.132802 0.125853 0.127549 0.126142 0.126701
qa: -0.0528 -0.0470 -0.2644 -0.4145 -0.2978 0.0746 0.0458 -0.1097 -0.2333 -0.2489 -0.2320 0.3934 0.0392 0.0566 -0.0124 -0.2290 -0.1179 0.2277 -0.1272 -0.1569 0.2255 -0.1590 -0.1933 -0.1164 -0.1000 -0.1359 0.0786 0.0873 0.0737 0.0892 0.0922 0.0919 0.0891 0.1017 0.1349 0.1103 0.1080 0.1101 0.1204 0.1267 0.1326 0.1328 0.1259 0.1275 0.1261 0.1267
va: 1.2758 1.2596 2.1437 2.0699 2.1040 3.7665 3.7890 3.9196 3.9127 3.9141 3.8862 4.1185 4.2412 3.8485 3.7001 4.0749 3.9524 3.8621 3.9787 3.9236 3.8224 3.9608 4.0353 3.9444 3.9345 3.9545 1.0329 1.0300 1.0087 1.0044 1.0042 1.0018 1.0021 1.0195 1.0363 0.9947 1.0110 1.0261 1.0229 1.0013 1.0048 1.0033 1.0130 0.9998 0.9992 1.0001
dispcorr: -0.021584919 hartree
energy: -1958.447277236654
dipole: 19.56241 -19.21325 0.34916 -33.52210 32.32602 -1.19608 15.56993 -15.08712 0.48281
magnitude: 1.33627 au
magnitude: 3.39654 debye
