program: Gaussian 09
title: 000074876
version: EM64L-G09RevD.01
frameworkgroup: C1[X(C13H18O)]
method: RPBEPBE
basis: SDD
operation: Freq
keyword: #pfreq=noraman
keyword: PBEPBE/SDD
title: #p freq=noraman PBEPBE/SDD
converged: YES YES NO NO
title: Mulliken charges:
elementType: O C C C C C C C C C C C C C H H H H H H H H H H H H H H H H H H
charge: -0.199769 0.193668 0.179101 0.208806 0.128570 0.148214 0.039918 -0.854256 -0.873974 -0.857634 -0.858244 -0.842309 0.001680 -0.758510 0.237910 0.247872 0.231651 0.234191 0.236500 0.253060 0.232113 0.233467 0.252865 0.230263 0.239777 0.249856 0.225893 0.252374 0.239548 0.252552 0.253809 0.241035
chargesum: 0.00000
title: Mulliken charges with hydrogens summed into heavy atoms:
elementType: O C C C C C C C C C C C C C
charge: -0.199769 0.193668 0.179101 0.208806 0.128570 0.148214 0.039918 -0.136822 -0.150223 -0.139188 -0.138348 -0.124494 0.001680 -0.011113
polarizability: 1.76386776e+02 2.41316932e-01 1.61493910e+02 2.08088538e+00 6.84867981e-01 9.50848949e+01
1716.lowfreq: -7.7366 -0.0004 0.0006 0.0007 6.4824 7.8290 34.0434 57.3071 74.1255
frequency: 33.8473 57.2608 74.1113 93.7025 113.0901 128.9202 133.3813 158.1701 171.8613 178.7340 195.3782 227.2980 264.3310 283.3467 341.7630 347.8092 353.9553 368.5582 389.1145 434.3540 444.1674 491.4421 513.1414 553.5007 580.0586 581.4562 623.7786 641.4072 759.0135 772.8651 818.1419 928.4965 975.2217 988.8247 999.8856 1004.0561 1016.9612 1022.0677 1035.7877 1039.2825 1046.7402 1055.8573 1076.6605 1082.6139 1095.7693 1168.8437 1268.4154 1324.3744 1345.9792 1365.4362 1391.6476 1395.4220 1400.0165 1403.3761 1406.0855 1411.8782 1419.6879 1438.6631 1447.6210 1453.5988 1458.9601 1469.4003 1473.0247 1479.5245 1484.5194 1491.5260 1494.4893 1501.8592 1508.0267 1579.5441 1585.4610 1605.6820 2969.3180 2971.0833 2975.0655 2975.8626 2977.2241 2980.8909 3041.8518 3044.7981 3049.0005 3049.8362 3051.1589 3067.7666 3090.5485 3104.2428 3106.1194 3109.9586 3110.6947 3116.8004
redmass: 3.7112 1.4246 2.0241 1.6206 1.1251 1.5119 1.6352 1.9744 1.8588 1.5443 1.1091 1.4528 2.9005 3.8176 2.6652 3.1370 3.1138 2.5377 2.5755 3.8898 4.7419 4.6320 2.8296 3.9007 3.7691 3.3360 2.4235 4.0875 3.0829 3.5358 2.7281 2.8407 1.6414 1.4924 1.5497 1.3923 1.4762 1.4521 1.5488 2.1885 1.5901 1.7565 2.1787 2.5374 1.9369 3.8832 6.0520 9.0878 6.0562 1.2377 1.2683 1.2180 1.2198 1.3272 1.5842 2.0763 3.0167 1.0764 1.0760 1.1446 1.0914 1.0848 1.0829 1.1177 1.1205 1.0827 1.0798 1.0494 1.0844 6.1020 5.8896 8.1350 1.0429 1.0440 1.0397 1.0413 1.0387 1.0401 1.0932 1.0964 1.0926 1.0969 1.0973 1.0917 1.0962 1.0956 1.0954 1.0944 1.0941 1.1026
irintensity: 4.6921 0.3184 1.1502 0.0449 0.7845 0.6211 0.8944 3.7879 2.3294 0.1140 0.2697 1.7400 2.5223 4.8531 1.0965 0.8005 0.6017 0.2370 0.0604 0.3891 0.0786 2.9285 0.8136 4.1531 4.1821 0.5144 0.1751 3.2260 1.5394 0.1774 0.7037 20.6144 1.2577 5.1865 7.6566 15.2459 1.7397 1.7987 1.3762 3.5788 0.8182 1.4487 13.4444 8.4604 0.8891 65.2702 26.4941 39.4836 0.3183 69.5536 0.9200 1.6466 22.9856 28.3123 10.8244 3.7771 8.7445 28.6374 19.6860 5.9932 1.5995 28.0714 5.4904 13.1959 15.5433 14.7362 13.8329 2.9625 9.1205 4.8363 8.0660 131.6736 64.3226 10.9812 22.1850 41.2702 2.7953 25.8209 42.0410 17.5837 5.3598 13.4406 19.1372 11.2700 24.3617 44.9884 16.8061 2.1714 10.4003 16.2964
temp: 298.150 k
press: 1.00000 atm
elementType: 8 6 6 6 6 6 6 6 6 6 6 6 6 6 1 1 1 1 1 1 1 1 1 1 1 1 1 1 1 1 1 1
symmnumber: 1
zpe: 712145.7 jmol-1
zpe.correction: 0.271242 hartree
zpe.thermalcorrener: 0.287653 hartree
zpe.thermalcorrenthalpy: 0.288598 hartree
zpe.thermalcorrgfe: 0.227810 hartree
zpe.sumelectzpe: -580.353071 hartree
zpe.sumelectthermal: -580.336660 hartree
zpe.sumelectthermalent: -580.335715 hartree
zpe.sumelectthermalfe: -580.396503 hartree
dipole: 2.6004 0.7864 2.4149
dipole: 3.6349
quadrupole: -86.6150 -77.1935 -89.0360
quadrupole: -2.8225 -8.1576 -1.3784
quadrupole: -2.3335 7.0880 -4.7545 -2.8225 -8.1576 -1.3784
hfenergy: -580.624313 hartree
pointgroup: C01 [X(C13H18O1)]
dipole: 1.0357004 0.2379641 0.9569598 debye
polarizability: 176.4212434|-0.0452296|161.1725968|1.3703895|4.6281523|95.3717403 unknown
InChI: InChI=1S/C13H18O/c1-7-8(2)10(4)13(12(6)14)11(5)9(7)3/h1-6H3
charge 0 multiplicity 1
32 atoms
O  -3.103764 -0.354608 -1.070309
C  1.911826 -0.022787 0.05296
C  1.202284 1.213978 0.06247
C  1.209862 -1.260408 -0.040118
C  -0.221611 1.210141 0.006462
C  -0.213523 -1.274833 -0.09213
C  -0.912938 -0.034043 -0.048375
C  3.432389 -0.04546 0.120235
C  1.970171 2.52912 0.123922
C  2.001944 -2.559866 -0.07988
C  -1.000086 2.521885 -0.044681
C  -0.967022 -2.597785 -0.166021
C  -2.430723 -0.041573 -0.049322
C  -3.115732 0.265491 1.281047
H  3.874819 -0.287629 -0.867235
H  3.853804 0.919459 0.439739
H  3.792259 -0.816972 0.824783
H  2.532373 2.625088 1.073144
H  2.708094 2.607226 -0.69634
H  1.305989 3.402924 0.052881
H  2.837631 -2.499051 -0.800896
H  2.450498 -2.791764 0.907207
H  1.379411 -3.420269 -0.366938
H  -0.869637 3.1195 0.877971
H  -0.663504 3.150441 -0.88984
H  -2.07977 2.358383 -0.191044
H  -0.688634 -3.268238 0.668515
H  -2.058468 -2.460335 -0.143469
H  -0.739095 -3.134814 -1.106258
H  -4.190448 0.456546 1.129261
H  -2.63956 1.112144 1.804417
H  -3.00134 -0.618191 1.940943
