program: Orca
programVersion: 5.0.2
elementType: Cl Cl O O O C C C C C C C C C C C C C C C C C C C C C H H H H H H H H H H H H H H H H H H H H
charge: 0
multiplicity: 1
keywords: wb97x-d3
keywords: def2-TZVPP
keywords: def2/J RIJCOSX
keywords: DEFGRID2
keywords: scfconv7
keywords: smallprint printgap noloewdin
keywords: NOSOSCF
formula: C21H20Cl2O3
InChI: InChI=1/C21H20Cl2O3/c1-21(2)17(12-18(22)23)19(21)20(24)25-13-14-7-6-10-16(11-14)26-15-8-4-3-5-9-15/h3-12,17,19H,13H2,1-2H3
46 atoms
Cl -4.95748 4.605992 -1.361712
Cl -2.633922 6.22726 -0.832778
O  -0.255551 0.105538 -1.737026
O  -0.021587 1.940847 -0.48302
O  2.06502 -4.099094 0.4771
C  -2.909207 1.222616 0.475178
C  -3.099438 2.18921 -0.657035
C  -2.193139 0.977973 -0.8367
C  -4.061192 0.289086 0.766139
C  -2.159162 1.635889 1.717025
C  -2.58096 3.563383 -0.616018
C  -0.723946 1.093735 -0.972843
C  -3.299237 4.642993 -0.899176
C  1.161842 0.01381 -1.90754
C  1.803877 -0.696156 -0.750094
C  1.693199 -2.07868 -0.652851
C  2.493088 0.006633 0.23003
C  2.259895 -2.751484 0.418381
C  3.060852 -0.674545 1.296437
C  2.946434 -2.050681 1.403525
C  3.049638 -4.91417 0.955376
C  4.381903 -4.757216 0.591862
C  2.665652 -5.957592 1.784853
C  5.326406 -5.651338 1.070966
C  3.619722 -6.849987 2.249098
C  4.953494 -6.698606 1.901069
H  -4.040144 2.088277 -1.185918
H  -2.615977 0.190986 -1.449809
H  -4.768477 0.75731 1.452493
H  -4.607867 0.016951 -0.137513
H  -3.705812 -0.632621 1.229813
H  -2.843172 2.139821 2.401615
H  -1.765187 0.756639 2.229214
H  -1.324954 2.304052 1.528282
H  -1.548497 3.724717 -0.338705
H  1.290989 -0.555231 -2.827891
H  1.598235 1.002682 -2.05483
H  1.162421 -2.644401 -1.409442
H  2.573265 1.083141 0.166314
H  3.591665 -0.126636 2.063605
H  3.383736 -2.570751 2.245865
H  4.680169 -3.948615 -0.062982
H  1.623653 -6.06753 2.055087
H  6.362896 -5.528909 0.785405
H  3.316225 -7.663872 2.894179
H  5.696167 -7.393214 2.269252
totalener: -1958.42591840 hartree
nucrepener: 2404.71506367 hartree
electener: -4363.14098207 hartree
oneelecener: -7462.68952936 hartree
twoeener: 3099.54854729 hartree
kineticenergy: 1952.61450674 hartree
xcener: -143.513483291048 hartree
chargesum: -0.0000000
charge: -0.053352 -0.047296 -0.264389 -0.414811 -0.299500 0.072050 0.047086 -0.104894 -0.234194 -0.250622 -0.230869 0.393850 0.039080 0.056505 -0.005430 -0.234464 -0.120064 0.221479 -0.118416 -0.158431 0.237521 -0.159457 -0.206367 -0.116963 -0.093808 -0.143080 0.076876 0.087180 0.091779 0.072941 0.091689 0.092154 0.091108 0.100942 0.134550 0.109752 0.108701 0.111682 0.121080 0.128187 0.133644 0.132856 0.125020 0.127121 0.125765 0.125809
qa: -0.0534 -0.0473 -0.2644 -0.4148 -0.2995 0.0721 0.0471 -0.1049 -0.2342 -0.2506 -0.2309 0.3938 0.0391 0.0565 -0.0054 -0.2345 -0.1201 0.2215 -0.1184 -0.1584 0.2375 -0.1595 -0.2064 -0.1170 -0.0938 -0.1431 0.0769 0.0872 0.0918 0.0729 0.0917 0.0922 0.0911 0.1009 0.1346 0.1098 0.1087 0.1117 0.1211 0.1282 0.1336 0.1329 0.1250 0.1271 0.1258 0.1258
va: 1.2749 1.2595 2.1426 2.0696 2.1036 3.7710 3.7877 3.9150 3.9122 3.9130 3.8884 4.1207 4.2422 3.8491 3.6845 4.0857 3.9518 3.8620 3.9622 3.9391 3.8131 3.9404 4.0344 3.9480 3.9356 3.9591 1.0340 1.0299 1.0042 1.0088 1.0042 1.0019 1.0020 1.0195 1.0364 0.9942 1.0117 1.0257 1.0226 1.0007 1.0031 1.0036 1.0138 0.9998 0.9988 1.0003
dispcorr: -0.021569344 hartree
energy: -1958.447487743891
dipole: 18.25189 -17.79594 0.45595 -36.14332 34.91776 -1.22556 14.15798 -13.88205 0.27593
magnitude: 1.33642 au
magnitude: 3.39692 debye
