program: Orca
programVersion: 5.0.2
elementType: Cl Cl O O O C C C C C C C C C C C C C C C C C C C C C H H H H H H H H H H H H H H H H H H H H
charge: 0
multiplicity: 1
keywords: wb97x-d3
keywords: def2-TZVPP
keywords: def2/J RIJCOSX
keywords: DEFGRID2
keywords: scfconv7
keywords: smallprint printgap noloewdin
keywords: NOSOSCF
formula: C21H20Cl2O3
InChI: InChI=1/C21H20Cl2O3/c1-21(2)17(12-18(22)23)19(21)20(24)25-13-14-7-6-10-16(11-14)26-15-8-4-3-5-9-15/h3-12,17,19H,13H2,1-2H3
46 atoms
Cl -5.07453 0.856805 -2.081429
Cl -3.28046 1.888401 -4.087294
O  0.465166 1.218443 1.328334
O  0.067202 2.573541 -0.407831
O  3.822476 -3.238331 0.541209
C  -2.722092 2.93032 0.94617
C  -2.902892 1.811212 -0.036811
C  -1.742333 1.775562 0.950981
C  -3.683221 2.967079 2.110704
C  -2.324392 4.306145 0.471436
C  -2.704355 2.000957 -1.480282
C  -0.332406 1.918959 0.522272
C  -3.572454 1.629375 -2.412838
C  1.876432 1.235698 1.079477
C  2.299962 0.083705 0.212854
C  2.837886 -1.05279 0.803293
C  2.167193 0.1430 -1.171774
C  3.234164 -2.127115 0.015655
C  2.564061 -0.933643 -1.947553
C  3.093584 -2.073102 -1.362483
C  3.385111 -3.747444 1.729294
C  2.033281 -3.865391 2.030376
C  4.346287 -4.203141 2.619904
C  1.65365 -4.43526 3.235336
C  3.951529 -4.779809 3.817316
C  2.606244 -4.893699 4.133915
H  -3.687564 1.107145 0.215038
H  -1.86939 1.068181 1.762028
H  -4.588522 3.513255 1.841107
H  -3.982795 1.967925 2.42882
H  -3.233643 3.468565 2.969477
H  -3.214921 4.848678 0.150711
H  -1.870976 4.870268 1.288124
H  -1.620801 4.30338 -0.354793
H  -1.79738 2.478719 -1.823261
H  2.17323 2.187727 0.638553
H  2.335514 1.157806 2.064748
H  2.955757 -1.097606 1.879681
H  1.759268 1.028572 -1.638913
H  2.460011 -0.888352 -3.023401
H  3.407203 -2.915362 -1.964936
H  1.28321 -3.519658 1.33067
H  5.394229 -4.108258 2.36748
H  0.600858 -4.528381 3.467068
H  4.703935 -5.136021 4.508459
H  2.301781 -5.339383 5.071055
totalener: -1958.42564846 hartree
nucrepener: 2445.91274406 hartree
electener: -4404.33839252 hartree
oneelecener: -7544.98176668 hartree
twoeener: 3140.64337416 hartree
kineticenergy: 1952.61007449 hartree
xcener: -143.513105444403 hartree
chargesum: -0.0000000
charge: -0.052758 -0.047052 -0.262118 -0.422617 -0.299247 0.072127 0.054725 -0.109851 -0.232695 -0.251493 -0.232555 0.395478 0.039755 0.055794 -0.001929 -0.182771 -0.156765 0.210192 -0.098311 -0.195277 0.236146 -0.157263 -0.209987 -0.114860 -0.091744 -0.146153 0.076956 0.087308 0.092582 0.073058 0.089434 0.092695 0.087669 0.103926 0.132683 0.115927 0.098052 0.118540 0.140726 0.127647 0.127061 0.132995 0.125931 0.126743 0.125665 0.125630
qa: -0.0528 -0.0471 -0.2621 -0.4226 -0.2992 0.0721 0.0547 -0.1099 -0.2327 -0.2515 -0.2326 0.3955 0.0398 0.0558 -0.0019 -0.1828 -0.1568 0.2102 -0.0983 -0.1953 0.2361 -0.1573 -0.2100 -0.1149 -0.0917 -0.1462 0.0770 0.0873 0.0926 0.0731 0.0894 0.0927 0.0877 0.1039 0.1327 0.1159 0.0981 0.1185 0.1407 0.1276 0.1271 0.1330 0.1259 0.1267 0.1257 0.1256
va: 1.2755 1.2599 2.1488 2.0576 2.1059 3.7625 3.7851 3.9303 3.9129 3.9102 3.8899 4.1135 4.2445 3.8374 3.7255 3.9827 3.9569 3.8728 3.9590 4.0354 3.8225 3.9386 4.0352 3.9456 3.9336 3.9618 1.0334 1.0301 1.0041 1.0087 1.0043 1.0022 1.0022 1.0190 1.0360 1.0117 1.0024 1.0126 1.0184 1.0000 1.0120 1.0043 1.0137 0.9999 0.9988 1.0003
dispcorr: -0.021564830 hartree
energy: -1958.447213290092
dipole: 15.80840 -15.73920 0.06920 1.55091 -1.52894 0.02197 29.08045 -27.74422 1.33623
magnitude: 1.33820 au
magnitude: 3.40143 debye
