program: Orca
programVersion: 5.0.2
elementType: Cl Cl O O O C C C C C C C C C C C C C C C C C C C C C H H H H H H H H H H H H H H H H H H H H
charge: 0
multiplicity: 1
keywords: wb97x-d3
keywords: def2-TZVPP
keywords: def2/J RIJCOSX
keywords: DEFGRID2
keywords: scfconv7
keywords: smallprint printgap noloewdin
keywords: NOSOSCF
formula: C21H20Cl2O3
InChI: InChI=1/C21H20Cl2O3/c1-21(2)17(12-18(22)23)19(21)20(24)25-13-14-7-6-10-16(11-14)26-15-8-4-3-5-9-15/h3-12,17,19H,13H2,1-2H3
46 atoms
Cl -4.168621 -0.601257 -1.26815
Cl -2.729235 0.194922 -3.63439
O  1.023431 1.942289 1.424646
O  0.367727 2.672305 -0.582357
O  3.37943 -2.765836 0.606982
C  -2.431436 2.932283 0.769688
C  -2.409511 1.548376 0.189815
C  -1.25573 2.027964 1.066284
C  -3.375931 3.158702 1.927322
C  -2.295671 4.143814 -0.119674
C  -2.250819 1.301151 -1.248903
C  0.099142 2.257519 0.515783
C  -2.956913 0.418569 -1.945027
C  2.393448 2.017831 1.019807
C  2.784994 0.827324 0.192082
C  2.890069 -0.417526 0.801827
C  3.024726 0.949337 -1.170568
C  3.224266 -1.532695 0.046641
C  3.378195 -0.166922 -1.912969
C  3.471806 -1.411974 -1.313339
C  2.470571 -3.224058 1.514911
C  1.111455 -2.947693 1.419592
C  2.95181 -4.039342 2.530003
C  0.241861 -3.485195 2.356117
C  2.068607 -4.5772 3.45288
C  0.711785 -4.299852 3.375616
H  -3.048328 0.832925 0.694418
H  -1.244061 1.596256 2.060235
H  -3.480101 2.270261 2.551641
H  -3.022638 3.972337 2.563324
H  -4.36951 3.426232 1.563707
H  -3.272998 4.402905 -0.530693
H  -1.944958 4.99848 0.461488
H  -1.608691 4.010681 -0.949227
H  -1.512653 1.869988 -1.796969
H  2.588868 2.949315 0.485847
H  2.951737 2.03896 1.955681
H  2.710521 -0.517502 1.866226
H  2.922808 1.912955 -1.650798
H  3.565808 -0.071205 -2.974056
H  3.736885 -2.289764 -1.887912
H  0.730017 -2.323538 0.621829
H  4.011694 -4.249985 2.586994
H  -0.815445 -3.26847 2.27824
H  2.448053 -5.213175 4.241888
H  0.026616 -4.717089 4.101118
totalener: -1958.42554977 hartree
nucrepener: 2536.35672687 hartree
electener: -4494.78227664 hartree
oneelecener: -7725.98865848 hartree
twoeener: 3231.20638185 hartree
kineticenergy: 1952.61441847 hartree
xcener: -143.513650382372 hartree
chargesum: 0.0000000
charge: -0.054065 -0.046046 -0.266007 -0.410258 -0.300588 0.067910 0.054995 -0.099918 -0.232501 -0.252540 -0.231549 0.387134 0.039681 0.058453 -0.011548 -0.198758 -0.118840 0.221028 -0.098482 -0.195528 0.246796 -0.157311 -0.217286 -0.118472 -0.088068 -0.150014 0.075466 0.087197 0.073242 0.089855 0.092369 0.092030 0.087563 0.103589 0.129766 0.104444 0.112810 0.122042 0.115683 0.125869 0.127223 0.132471 0.124596 0.126233 0.124742 0.124591
qa: -0.0541 -0.0460 -0.2660 -0.4103 -0.3006 0.0679 0.0550 -0.0999 -0.2325 -0.2525 -0.2315 0.3871 0.0397 0.0585 -0.0115 -0.1988 -0.1188 0.2210 -0.0985 -0.1955 0.2468 -0.1573 -0.2173 -0.1185 -0.0881 -0.1500 0.0755 0.0872 0.0732 0.0899 0.0924 0.0920 0.0876 0.1036 0.1298 0.1044 0.1128 0.1220 0.1157 0.1259 0.1272 0.1325 0.1246 0.1262 0.1247 0.1246
va: 1.2740 1.2606 2.1393 2.0766 2.1056 3.7709 3.7833 3.8971 3.9123 3.9106 3.9003 4.1281 4.2473 3.8596 3.6800 3.9689 3.9612 3.8451 3.9546 4.0350 3.8159 3.9265 4.0359 3.9489 3.9347 3.9638 1.0357 1.0300 1.0084 1.0044 1.0042 1.0019 1.0020 1.0200 1.0371 1.0110 0.9934 1.0149 1.0216 0.9996 1.0114 1.0049 1.0143 1.0003 0.9986 1.0006
dispcorr: -0.022388195 hartree
energy: -1958.447937962455
dipole: 10.63934 -10.62764 0.01170 12.61281 -12.06535 0.54747 22.50004 -21.42684 1.07320
magnitude: 1.20483 au
magnitude: 3.06243 debye
