program: Orca
programVersion: 5.0.2
elementType: Cl Cl O O O C C C C C C C C C C C C C C C C C C C C C H H H H H H H H H H H H H H H H H H H H
charge: 0
multiplicity: 1
keywords: wb97x-d3
keywords: def2-TZVPP
keywords: def2/J RIJCOSX
keywords: DEFGRID2
keywords: scfconv7
keywords: smallprint printgap noloewdin
keywords: NOSOSCF
formula: C21H20Cl2O3
InChI: InChI=1/C21H20Cl2O3/c1-21(2)17(12-18(22)23)19(21)20(24)25-13-14-7-6-10-16(11-14)26-15-8-4-3-5-9-15/h3-12,17,19H,13H2,1-2H3
46 atoms
Cl -5.528135 2.710196 -0.05878
Cl -5.296681 -0.118624 -0.561668
O  0.674035 1.764533 1.720695
O  -0.453172 0.370116 0.390827
O  3.508683 -2.537393 -1.004903
C  -1.226675 3.07271 -1.029945
C  -2.38973 2.701166 -0.155364
C  -0.981679 2.715173 0.421635
C  -1.075158 4.536749 -1.369397
C  -0.77813 2.160157 -2.144502
C  -3.151053 1.458932 -0.344465
C  -0.261841 1.481398 0.809942
C  -4.475163 1.373184 -0.321791
C  1.524036 0.691617 2.124419
C  2.517038 0.325457 1.057153
C  2.539667 -0.961242 0.540503
C  3.412625 1.277915 0.58076
C  3.469389 -1.301233 -0.434754
C  4.323279 0.934492 -0.404699
C  4.363702 -0.354818 -0.912154
C  3.220971 -3.638357 -0.249028
C  3.85298 -3.868396 0.966794
C  2.315325 -4.556428 -0.757859
C  3.570773 -5.028355 1.670194
C  2.047625 -5.717183 -0.047345
C  2.668871 -5.956526 1.168812
H  -2.987874 3.539548 0.18283
H  -0.767906 3.556599 1.070452
H  -1.41125 5.183999 -0.558407
H  -0.031644 4.779586 -1.57751
H  -1.659401 4.787702 -2.256205
H  -0.862113 1.102954 -1.912343
H  -1.374999 2.355112 -3.03682
H  0.265814 2.356462 -2.394263
H  -2.610445 0.538523 -0.511723
H  2.035145 1.071131 3.009563
H  0.934316 -0.177488 2.422512
H  1.817452 -1.690757 0.885094
H  3.397596 2.285591 0.976915
H  5.020766 1.673465 -0.77665
H  5.077397 -0.631194 -1.676934
H  4.563845 -3.150845 1.356425
H  1.830816 -4.35928 -1.705089
H  4.06599 -5.209614 2.61509
H  1.341351 -6.433416 -0.446109
H  2.455537 -6.861396 1.721373
totalener: -1958.42513634 hartree
nucrepener: 2470.65637773 hartree
electener: -4429.08151407 hartree
oneelecener: -7594.74803297 hartree
twoeener: 3165.66651890 hartree
kineticenergy: 1952.61963560 hartree
xcener: -143.514407027060 hartree
chargesum: -0.0000000
charge: -0.054624 -0.048005 -0.269209 -0.400080 -0.300128 0.062925 0.057760 -0.096202 -0.233502 -0.248015 -0.229088 0.379609 0.037865 0.058485 -0.009767 -0.081955 -0.219297 0.195364 -0.080425 -0.208792 0.218624 -0.146034 -0.192796 -0.119602 -0.097498 -0.137911 0.075928 0.085224 0.073266 0.089216 0.092359 0.101100 0.093121 0.089385 0.130537 0.114480 0.102203 0.115770 0.114788 0.124688 0.126335 0.130136 0.125980 0.126491 0.125863 0.125431
qa: -0.0546 -0.0480 -0.2692 -0.4001 -0.3001 0.0629 0.0578 -0.0962 -0.2335 -0.2480 -0.2291 0.3796 0.0379 0.0585 -0.0098 -0.0820 -0.2193 0.1954 -0.0804 -0.2088 0.2186 -0.1460 -0.1928 -0.1196 -0.0975 -0.1379 0.0759 0.0852 0.0733 0.0892 0.0924 0.1011 0.0931 0.0894 0.1305 0.1145 0.1022 0.1158 0.1148 0.1247 0.1263 0.1301 0.1260 0.1265 0.1259 0.1254
va: 1.2739 1.2585 2.1352 2.0891 2.1031 3.7861 3.7797 3.8956 3.9106 3.9144 3.8940 4.1422 4.2435 3.8663 3.6998 3.8644 4.0064 3.8614 3.9271 4.0404 3.8386 3.9496 4.0344 3.9476 3.9360 3.9552 1.0353 1.0303 1.0086 1.0044 1.0041 1.0192 1.0014 1.0029 1.0393 0.9891 1.0116 1.0232 1.0157 0.9987 1.0123 1.0046 1.0130 0.9998 0.9989 1.0002
dispcorr: -0.022156622 hartree
energy: -1958.447292957469
dipole: 34.24469 -33.22221 1.02248 1.50720 -0.90333 0.60387 -1.89437 2.27638 0.38201
magnitude: 1.24742 au
magnitude: 3.17068 debye
