program: Orca
programVersion: 5.0.2
elementType: Cl Cl O O O C C C C C C C C C C C C C C C C C C C C C H H H H H H H H H H H H H H H H H H H H
charge: 0
multiplicity: 1
keywords: wb97x-d3
keywords: def2-TZVPP
keywords: def2/J RIJCOSX
keywords: DEFGRID2
keywords: scfconv7
keywords: smallprint printgap noloewdin
keywords: NOSOSCF
formula: C21H20Cl2O3
InChI: InChI=1/C21H20Cl2O3/c1-21(2)17(12-18(22)23)19(21)20(24)25-13-14-7-6-10-16(11-14)26-15-8-4-3-5-9-15/h3-12,17,19H,13H2,1-2H3
46 atoms
Cl -4.980025 4.246858 -0.505811
Cl -3.592673 4.953637 1.920691
O  0.821301 1.441698 -1.707224
O  0.112938 2.013334 0.331318
O  1.967914 -3.315151 -0.449864
C  -2.510505 0.60825 -0.701209
C  -2.736907 2.086272 -0.835943
C  -1.467643 1.463197 -1.393663
C  -3.322945 -0.286304 -1.606645
C  -2.239875 -0.010891 0.647886
C  -2.735216 2.992687 0.320089
C  -0.131342 1.683342 -0.798574
C  -3.647933 3.930891 0.539005
C  2.166043 1.456087 -1.23711
C  2.470587 0.269264 -0.366013
C  2.125509 -1.007084 -0.79321
C  3.110921 0.43337 0.853568
C  2.40683 -2.107187 0.002081
C  3.40922 -0.674165 1.632433
C  3.057016 -1.948777 1.220927
C  2.662218 -4.453362 -0.157912
C  1.936667 -5.554515 0.271262
C  4.037354 -4.540515 -0.337387
C  2.591782 -6.751891 0.515655
C  4.680903 -5.740405 -0.079728
C  3.964395 -6.849913 0.346471
H  -3.439422 2.365466 -1.612791
H  -1.445089 1.372424 -2.473377
H  -2.806466 -1.231275 -1.783458
H  -4.289051 -0.513596 -1.152881
H  -3.513683 0.174653 -2.576538
H  -1.697988 -0.950365 0.528287
H  -1.657866 0.616567 1.315868
H  -3.18707 -0.234678 1.141017
H  -1.944385 2.905298 1.051312
H  2.770982 1.433261 -2.144438
H  2.385132 2.387061 -0.709957
H  1.623002 -1.158962 -1.74077
H  3.359997 1.426629 1.203582
H  3.902413 -0.544113 2.586573
H  3.274108 -2.803219 1.848205
H  0.866419 -5.468717 0.405074
H  4.599587 -3.68118 -0.679802
H  2.023399 -7.610727 0.847287
H  5.751346 -5.80874 -0.221727
H  4.472508 -7.784358 0.541804
totalener: -1958.42507724 hartree
nucrepener: 2448.93037453 hartree
electener: -4407.35545178 hartree
oneelecener: -7551.18026957 hartree
twoeener: 3143.82481780 hartree
kineticenergy: 1952.62561506 hartree
xcener: -143.516262114108 hartree
chargesum: -0.0000000
charge: -0.054545 -0.047842 -0.272806 -0.388219 -0.300573 0.064911 0.054661 -0.079034 -0.234381 -0.249257 -0.228347 0.347946 0.038675 0.073580 0.056454 -0.288504 -0.150226 0.253091 -0.106366 -0.170316 0.233219 -0.199819 -0.159930 -0.097749 -0.118209 -0.138562 0.075567 0.086140 0.090765 0.092461 0.073219 0.090074 0.100789 0.093517 0.130959 0.109196 0.101341 0.115783 0.106504 0.126701 0.132646 0.123811 0.133206 0.125909 0.127384 0.126177
qa: -0.0545 -0.0478 -0.2728 -0.3882 -0.3006 0.0649 0.0547 -0.0790 -0.2344 -0.2493 -0.2283 0.3479 0.0387 0.0736 0.0565 -0.2885 -0.1502 0.2531 -0.1064 -0.1703 0.2332 -0.1998 -0.1599 -0.0977 -0.1182 -0.1386 0.0756 0.0861 0.0908 0.0925 0.0732 0.0901 0.1008 0.0935 0.1310 0.1092 0.1013 0.1158 0.1065 0.1267 0.1326 0.1238 0.1332 0.1259 0.1274 0.1262
va: 1.2739 1.2586 2.1259 2.0978 2.0976 3.7865 3.7935 3.8795 3.9102 3.9143 3.8960 4.1690 4.2404 3.8528 3.6742 4.0547 4.0094 3.8151 3.9599 3.9480 3.8184 4.0365 3.9481 3.9379 3.9456 3.9554 1.0358 1.0300 1.0044 1.0039 1.0085 1.0028 1.0190 1.0019 1.0390 0.9889 1.0109 1.0334 1.0141 1.0008 1.0044 1.0139 1.0037 0.9990 0.9998 1.0002
dispcorr: -0.022213137 hartree
energy: -1958.447290378975
dipole: 22.25270 -21.45883 0.79387 -36.01932 34.88369 -1.13563 -5.07219 4.61024 -0.46195
magnitude: 1.46058 au
magnitude: 3.71249 debye
