program: Orca
programVersion: 5.0.2
elementType: Cl Cl O O O C C C C C C C C C C C C C C C C C C C C C H H H H H H H H H H H H H H H H H H H H
charge: 0
multiplicity: 1
keywords: wb97x-d3
keywords: def2-TZVPP
keywords: def2/J RIJCOSX
keywords: DEFGRID2
keywords: scfconv7
keywords: smallprint printgap noloewdin
keywords: NOSOSCF
formula: C21H20Cl2O3
InChI: InChI=1/C21H20Cl2O3/c1-21(2)17(12-18(22)23)19(21)20(24)25-13-14-7-6-10-16(11-14)26-15-8-4-3-5-9-15/h3-12,17,19H,13H2,1-2H3
46 atoms
Cl -5.203011 2.381624 0.318106
Cl -4.946169 -0.12188 1.722917
O  1.216835 2.169651 0.928755
O  -0.025028 0.309001 0.988242
O  3.813858 -2.416431 -0.78143
C  -1.291846 1.533737 -1.584905
C  -2.201795 1.938665 -0.462645
C  -0.703544 2.181839 -0.348296
C  -1.314963 2.401831 -2.820929
C  -1.05656 0.076911 -1.899608
C  -2.907301 0.959596 0.374208
C  0.161711 1.429257 0.587119
C  -4.176442 1.067365 0.747558
C  2.255318 1.546483 1.694606
C  3.22936 0.851493 0.786849
C  3.046608 -0.489535 0.462325
C  4.290436 1.558818 0.237069
C  3.919919 -1.109397 -0.421702
C  5.165837 0.926061 -0.633057
C  4.98459 -0.403134 -0.970623
C  2.643268 -3.084993 -0.541073
C  2.63308 -4.090659 0.411107
C  1.500252 -2.784639 -1.268451
C  1.465853 -4.807701 0.631834
C  0.338314 -3.501666 -1.034593
C  0.316186 -4.513403 -0.084779
H  -2.758898 2.851385 -0.639233
H  -0.403856 3.215957 -0.470758
H  -1.496933 3.450468 -2.583034
H  -0.364206 2.34168 -3.35335
H  -2.10167 2.076509 -3.503625
H  -0.994136 -0.563943 -1.025487
H  -1.864923 -0.291337 -2.533592
H  -0.123597 -0.036098 -2.455308
H  -2.370949 0.087823 0.72141
H  2.740018 2.365427 2.224921
H  1.833833 0.862669 2.432038
H  2.219376 -1.035045 0.896467
H  4.434983 2.602067 0.488705
H  5.996568 1.474024 -1.057594
H  5.660805 -0.902123 -1.652243
H  3.534861 -4.309847 0.967527
H  1.522311 -1.996213 -2.009696
H  1.456376 -5.59569 1.373068
H  -0.554055 -3.269109 -1.600742
H  -0.59323 -5.070847 0.09345
totalener: -1958.42488593 hartree
nucrepener: 2555.93403128 hartree
electener: -4514.35891720 hartree
oneelecener: -7765.15494306 hartree
twoeener: 3250.79602585 hartree
kineticenergy: 1952.62373574 hartree
xcener: -143.515439483423 hartree
chargesum: -0.0000000
charge: -0.053373 -0.047566 -0.261233 -0.412631 -0.298640 0.085738 0.054462 -0.092696 -0.233885 -0.279913 -0.230012 0.386894 0.038513 0.044548 -0.026781 -0.147232 -0.195941 0.243601 -0.079581 -0.219262 0.206063 -0.164801 -0.140267 -0.117368 -0.128553 -0.116805 0.075437 0.086730 0.073935 0.090982 0.091816 0.094550 0.099861 0.089465 0.131414 0.104566 0.115284 0.139423 0.106891 0.124132 0.124777 0.124923 0.127012 0.126084 0.132774 0.126666
qa: -0.0534 -0.0476 -0.2612 -0.4126 -0.2986 0.0857 0.0545 -0.0927 -0.2339 -0.2799 -0.2300 0.3869 0.0385 0.0445 -0.0268 -0.1472 -0.1959 0.2436 -0.0796 -0.2193 0.2061 -0.1648 -0.1403 -0.1174 -0.1286 -0.1168 0.0754 0.0867 0.0739 0.0910 0.0918 0.0946 0.0999 0.0895 0.1314 0.1046 0.1153 0.1394 0.1069 0.1241 0.1248 0.1249 0.1270 0.1261 0.1328 0.1267
va: 1.2751 1.2591 2.1444 2.0652 2.1130 3.7719 3.7911 3.9030 3.9107 3.9267 3.8898 4.1277 4.2485 3.8587 3.7436 3.8367 4.0326 3.8462 3.9446 4.0479 3.8693 4.0162 3.9777 3.9461 3.9402 3.9601 1.0363 1.0301 1.0090 1.0040 1.0037 1.0092 1.0031 0.9988 1.0372 0.9960 1.0121 1.0272 1.0119 0.9987 1.0142 1.0110 1.0017 0.9994 0.9958 1.0001
dispcorr: -0.024369978 hartree
energy: -1958.449255905808
dipole: 28.32947 -27.66506 0.66440 -3.82218 4.27318 0.45100 -15.68754 15.19307 -0.49446
magnitude: 0.94304 au
magnitude: 2.39702 debye
