program: Orca
programVersion: 5.0.2
elementType: Cl Cl O O O C C C C C C C C C C C C C C C C C C C C C H H H H H H H H H H H H H H H H H H H H
charge: 0
multiplicity: 1
keywords: wb97x-d3
keywords: def2-TZVPP
keywords: def2/J RIJCOSX
keywords: DEFGRID2
keywords: scfconv7
keywords: smallprint printgap noloewdin
keywords: NOSOSCF
formula: C21H20Cl2O3
InChI: InChI=1/C21H20Cl2O3/c1-21(2)17(12-18(22)23)19(21)20(24)25-13-14-7-6-10-16(11-14)26-15-8-4-3-5-9-15/h3-12,17,19H,13H2,1-2H3
46 atoms
Cl -5.466138 2.494641 0.271595
Cl -5.153361 -0.365994 0.452991
O  0.92012 2.14091 1.550187
O  -0.201559 0.448643 0.619503
O  4.145389 -2.424956 -0.323713
C  -1.345054 2.740502 -1.197306
C  -2.361877 2.538886 -0.111781
C  -0.894751 2.720614 0.248822
C  -1.324378 4.096824 -1.862087
C  -0.998238 1.615045 -2.140006
C  -3.070054 1.265973 0.076706
C  -0.060141 1.629714 0.7995
C  -4.382064 1.157019 0.243894
C  1.875886 1.222086 2.07709
C  2.81664 0.721673 1.017003
C  2.999098 -0.642123 0.842305
C  3.517409 1.623243 0.22316
C  3.882174 -1.105673 -0.125809
C  4.396279 1.152107 -0.738698
C  4.581015 -0.208529 -0.922099
C  3.216263 -3.384487 -0.040599
C  1.884013 -3.266074 -0.418107
C  3.670033 -4.532576 0.592171
C  1.00939 -4.307237 -0.147751
C  2.786398 -5.570288 0.845801
C  1.452592 -5.461471 0.482282
H  -2.958227 3.414329 0.117945
H  -0.654287 3.691209 0.66638
H  -1.585009 4.897673 -1.169074
H  -0.33419 4.31577 -2.265602
H  -2.036454 4.129879 -2.688309
H  -1.707317 1.604724 -2.969197
H  -0.001522 1.766549 -2.557294
H  -1.011501 0.632416 -1.678782
H  -2.500373 0.347478 0.083701
H  2.416662 1.796018 2.830096
H  1.37849 0.390403 2.580038
H  2.441088 -1.337602 1.456398
H  3.378083 2.68873 0.354521
H  4.943767 1.850193 -1.358395
H  5.263669 -0.58203 -1.673973
H  1.52769 -2.371071 -0.912074
H  4.711984 -4.608023 0.874325
H  -0.028521 -4.212916 -0.438124
H  3.144748 -6.465319 1.337062
H  0.763641 -6.269885 0.685998
totalener: -1958.42552994 hartree
nucrepener: 2494.86067585 hartree
electener: -4453.28620579 hartree
oneelecener: -7643.01417526 hartree
twoeener: 3189.72796947 hartree
kineticenergy: 1952.61489187 hartree
xcener: -143.514894771149 hartree
chargesum: -0.0000000
charge: -0.053073 -0.047584 -0.270011 -0.401919 -0.297549 0.070159 0.051392 -0.095211 -0.234413 -0.246811 -0.231113 0.373425 0.039812 0.063544 0.018342 -0.157559 -0.233166 0.258671 -0.069012 -0.225714 0.268722 -0.185749 -0.220271 -0.104723 -0.087526 -0.149069 0.077493 0.086258 0.073539 0.089742 0.092515 0.093457 0.091176 0.096214 0.131271 0.112402 0.101292 0.118198 0.115205 0.124190 0.124796 0.136261 0.123961 0.128404 0.124850 0.125180
qa: -0.0531 -0.0476 -0.2700 -0.4019 -0.2975 0.0702 0.0514 -0.0952 -0.2344 -0.2468 -0.2311 0.3734 0.0398 0.0635 0.0183 -0.1576 -0.2332 0.2587 -0.0690 -0.2257 0.2687 -0.1857 -0.2203 -0.1047 -0.0875 -0.1491 0.0775 0.0863 0.0735 0.0897 0.0925 0.0935 0.0912 0.0962 0.1313 0.1124 0.1013 0.1182 0.1152 0.1242 0.1248 0.1363 0.1240 0.1284 0.1249 0.1252
va: 1.2754 1.2589 2.1347 2.0843 2.1157 3.7740 3.7909 3.9003 3.9116 3.9180 3.8960 4.1386 4.2431 3.8609 3.7038 3.9172 4.0132 3.8413 3.9182 4.0459 3.7843 3.9593 4.0488 3.9389 3.9264 3.9649 1.0347 1.0303 1.0084 1.0042 1.0043 1.0023 1.0025 1.0183 1.0382 0.9881 1.0132 1.0160 1.0176 0.9987 1.0140 1.0040 1.0147 0.9993 0.9989 1.0005
dispcorr: -0.022434953 hartree
energy: -1958.447964894928
dipole: 30.30696 -29.63144 0.67553 1.98571 -1.24492 0.74080 -9.12360 9.04545 -0.07815
magnitude: 1.00560 au
magnitude: 2.55603 debye
