program: Orca
programVersion: 5.0.2
elementType: Cl Cl O O O C C C C C C C C C C C C C C C C C C C C C H H H H H H H H H H H H H H H H H H H H
charge: 0
multiplicity: 1
keywords: wb97x-d3
keywords: def2-TZVPP
keywords: def2/J RIJCOSX
keywords: DEFGRID2
keywords: scfconv7
keywords: smallprint printgap noloewdin
keywords: NOSOSCF
formula: C21H20Cl2O3
InChI: InChI=1/C21H20Cl2O3/c1-21(2)17(12-18(22)23)19(21)20(24)25-13-14-7-6-10-16(11-14)26-15-8-4-3-5-9-15/h3-12,17,19H,13H2,1-2H3
46 atoms
Cl -2.184857 1.275567 2.692807
Cl -2.733679 -0.78972 0.756615
O  1.240581 3.125316 -0.118913
O  -0.021903 2.301441 -1.767836
O  1.849903 -2.589723 -1.316541
C  -2.262575 4.208348 -0.853311
C  -2.218109 3.21843 0.270741
C  -0.933886 3.897035 -0.220602
C  -2.827231 5.568986 -0.510498
C  -2.609493 3.783179 -2.259918
C  -2.426655 1.776371 0.062766
C  0.105325 3.030011 -0.822653
C  -2.448059 0.877798 1.038412
C  2.239756 2.149165 -0.39878
C  1.8049 0.772613 0.024778
C  2.037029 -0.312722 -0.804902
C  1.178216 0.577452 1.251227
C  1.642685 -1.585869 -0.41804
C  0.774395 -0.693909 1.621888
C  0.999505 -1.784103 0.795645
C  2.145763 -3.85022 -0.891126
C  3.042039 -4.095472 0.142758
C  1.558875 -4.904439 -1.576409
C  3.339719 -5.404466 0.487352
C  1.874579 -6.208359 -1.228258
C  2.75999 -6.465935 -0.19257
H  -2.548416 3.582071 1.237461
H  -0.537964 4.644453 0.457619
H  -2.594503 5.867519 0.512666
H  -2.425879 6.333375 -1.177661
H  -3.913202 5.571041 -0.616282
H  -2.213777 2.814257 -2.543726
H  -3.6947 3.761513 -2.374005
H  -2.217841 4.507804 -2.974943
H  -2.575008 1.403458 -0.941332
H  2.513078 2.160039 -1.456289
H  3.107367 2.476204 0.175863
H  2.501835 -0.175999 -1.773525
H  0.983816 1.414444 1.909089
H  0.261284 -0.840327 2.562902
H  0.662937 -2.769374 1.089957
H  3.507227 -3.273826 0.671936
H  0.864945 -4.695434 -2.379841
H  4.038269 -5.593207 1.291873
H  1.416919 -7.027364 -1.767246
H  2.99983 -7.484606 0.079989
totalener: -1958.42139509 hartree
nucrepener: 2601.74444957 hartree
electener: -4560.16584466 hartree
oneelecener: -7857.20274917 hartree
twoeener: 3297.03690451 hartree
kineticenergy: 1952.63371356 hartree
xcener: -143.519623244348 hartree
chargesum: 0.0000000
charge: -0.060920 -0.041610 -0.270248 -0.372025 -0.298112 0.109487 -0.036954 -0.069898 -0.237129 -0.264348 -0.172201 0.327028 0.057384 0.063127 0.062517 -0.199160 -0.208910 0.239018 -0.136961 -0.161121 0.251589 -0.167400 -0.212154 -0.115611 -0.090565 -0.145439 0.083500 0.082759 0.073204 0.092102 0.091639 0.101641 0.091363 0.087209 0.120888 0.101943 0.107764 0.104856 0.119983 0.130792 0.131314 0.130932 0.124899 0.125702 0.124187 0.123940
qa: -0.0609 -0.0416 -0.2702 -0.3720 -0.2981 0.1095 -0.0370 -0.0699 -0.2371 -0.2643 -0.1722 0.3270 0.0574 0.0631 0.0625 -0.1992 -0.2089 0.2390 -0.1370 -0.1611 0.2516 -0.1674 -0.2122 -0.1156 -0.0906 -0.1454 0.0835 0.0828 0.0732 0.0921 0.0916 0.1016 0.0914 0.0872 0.1209 0.1019 0.1078 0.1049 0.1200 0.1308 0.1313 0.1309 0.1249 0.1257 0.1242 0.1239
va: 1.2672 1.2648 2.1182 2.1174 2.1086 3.7896 3.8669 3.8412 3.8997 3.9008 3.9017 4.2122 4.2329 3.8610 3.6877 4.0862 3.9187 3.8564 3.8873 3.9352 3.8080 3.9439 4.0387 3.9460 3.9320 3.9622 1.0243 1.0317 1.0072 1.0049 1.0046 1.0259 0.9989 1.0038 1.0250 1.0094 0.9887 1.0259 1.0277 1.0103 1.0045 1.0052 1.0143 1.0000 0.9991 1.0007
dispcorr: -0.026097320 hartree
energy: -1958.447492411019
dipole: 7.09284 -7.03679 0.05605 10.87103 -10.19444 0.67659 -12.57361 12.90611 0.33249
magnitude: 0.75596 au
magnitude: 1.92149 debye
