program: Orca
programVersion: 5.0.2
elementType: Cl Cl O O O C C C C C C C C C C C C C C C C C C C C C H H H H H H H H H H H H H H H H H H H H
charge: 0
multiplicity: 1
keywords: wb97x-d3
keywords: def2-TZVPP
keywords: def2/J RIJCOSX
keywords: DEFGRID2
keywords: scfconv7
keywords: smallprint printgap noloewdin
keywords: NOSOSCF
formula: C21H20Cl2O3
InChI: InChI=1/C21H20Cl2O3/c1-21(2)17(12-18(22)23)19(21)20(24)25-13-14-7-6-10-16(11-14)26-15-8-4-3-5-9-15/h3-12,17,19H,13H2,1-2H3
46 atoms
Cl -0.738606 2.377129 2.975438
Cl -1.94498 -0.220212 2.634206
O  0.868472 2.397575 -1.473474
O  -0.918008 1.082728 -1.734856
O  1.146373 -3.16926 0.392401
C  -2.669987 3.513142 -1.025551
C  -2.089962 3.103284 0.291161
C  -1.178656 3.325165 -0.922602
C  -3.119769 4.954059 -1.125078
C  -3.547021 2.582115 -1.826724
C  -2.25862 1.751737 0.85224
C  -0.446002 2.145793 -1.435372
C  -1.721403 1.356969 1.999049
C  1.715316 1.265069 -1.661653
C  1.688124 0.354375 -0.463889
C  1.450754 -1.002472 -0.62549
C  1.880376 0.875412 0.811681
C  1.429086 -1.839107 0.483851
C  1.834211 0.036497 1.912348
C  1.618599 -1.323092 1.756547
C  1.59117 -3.905018 -0.664925
C  2.881487 -3.782686 -1.167684
C  0.71786 -4.845411 -1.192987
C  3.286846 -4.607684 -2.205552
C  1.140227 -5.67051 -2.223332
C  2.422683 -5.553395 -2.738273
H  -2.004358 3.887029 1.036086
H  -0.582747 4.229358 -0.880356
H  -4.143682 5.061444 -0.763848
H  -2.490943 5.624007 -0.537271
H  -3.093224 5.297255 -2.160315
H  -4.578384 2.667443 -1.479934
H  -3.529534 2.868675 -2.879223
H  -3.252989 1.539297 -1.776539
H  -2.84436 1.021263 0.311574
H  1.447572 0.721822 -2.570392
H  2.709628 1.689974 -1.803814
H  1.254705 -1.400764 -1.613336
H  2.047795 1.935665 0.94998
H  1.968238 0.443379 2.905407
H  1.579647 -1.982892 2.612922
H  3.566544 -3.056502 -0.749189
H  -0.282403 -4.927362 -0.788695
H  4.29246 -4.51375 -2.59422
H  0.456943 -6.404736 -2.629374
H  2.748086 -6.195696 -3.54511
totalener: -1958.42143795 hartree
nucrepener: 2626.62084427 hartree
electener: -4585.04228223 hartree
oneelecener: -7907.10022245 hartree
twoeener: 3322.05794022 hartree
kineticenergy: 1952.62905479 hartree
xcener: -143.517836770033 hartree
chargesum: 0.0000000
charge: -0.062440 -0.041523 -0.269271 -0.378941 -0.298443 0.108413 -0.049416 -0.061642 -0.236747 -0.265164 -0.151324 0.331694 0.049535 0.057451 0.038410 -0.138554 -0.224791 0.259199 -0.088460 -0.240882 0.249354 -0.167444 -0.210309 -0.115247 -0.089717 -0.147280 0.087379 0.081637 0.091800 0.072946 0.091947 0.091408 0.087161 0.102040 0.115997 0.100349 0.110094 0.114058 0.116329 0.127875 0.122365 0.130560 0.125196 0.125933 0.124288 0.124177
qa: -0.0624 -0.0415 -0.2693 -0.3789 -0.2984 0.1084 -0.0494 -0.0616 -0.2367 -0.2652 -0.1513 0.3317 0.0495 0.0575 0.0384 -0.1386 -0.2248 0.2592 -0.0885 -0.2409 0.2494 -0.1674 -0.2103 -0.1152 -0.0897 -0.1473 0.0874 0.0816 0.0918 0.0729 0.0919 0.0914 0.0872 0.1020 0.1160 0.1003 0.1101 0.1141 0.1163 0.1279 0.1224 0.1306 0.1252 0.1259 0.1243 0.1242
va: 1.2633 1.2636 2.1229 2.1085 2.1094 3.7930 3.8648 3.8423 3.8987 3.8975 3.8892 4.1972 4.2090 3.8735 3.6727 3.9395 3.9339 3.8004 3.8579 4.0313 3.8170 3.9464 4.0393 3.9450 3.9305 3.9624 1.0219 1.0315 1.0045 1.0071 1.0048 0.9988 1.0038 1.0256 1.0262 1.0106 0.9894 1.0184 1.0243 1.0042 1.0145 1.0053 1.0143 0.9998 0.9990 1.0006
dispcorr: -0.026299360 hartree
energy: -1958.447737314190
dipole: -0.70561 0.84053 0.13492 4.97538 -4.16149 0.81389 -25.37652 24.76865 -0.60787
magnitude: 1.02475 au
magnitude: 2.60471 debye
