program: Orca
programVersion: 5.0.2
elementType: Cl Cl O O O C C C C C C C C C C C C C C C C C C C C C H H H H H H H H H H H H H H H H H H H H
charge: 0
multiplicity: 1
keywords: wb97x-d3
keywords: def2-TZVPP
keywords: def2/J RIJCOSX
keywords: DEFGRID2
keywords: scfconv7
keywords: smallprint printgap noloewdin
keywords: NOSOSCF
formula: C21H20Cl2O3
InChI: InChI=1/C21H20Cl2O3/c1-21(2)17(12-18(22)23)19(21)20(24)25-13-14-7-6-10-16(11-14)26-15-8-4-3-5-9-15/h3-12,17,19H,13H2,1-2H3
46 atoms
Cl -4.320628 3.415102 -1.257031
Cl -4.108328 3.899823 1.579889
O  0.809338 1.236166 -1.395073
O  -0.17825 1.617229 0.581389
O  2.991738 -2.391135 1.566683
C  -2.15448 -0.556558 -0.443455
C  -2.792574 0.776248 -0.67209
C  -1.376399 0.522723 -1.173597
C  -2.638395 -1.694818 -1.311268
C  -1.75346 -1.011556 0.938355
C  -3.077156 1.720172 0.421178
C  -0.220445 1.189986 -0.542515
C  -3.747366 2.854148 0.265634
C  2.063164 1.725605 -0.921474
C  2.975346 0.589155 -0.54814
C  2.558425 -0.380033 0.356482
C  4.248306 0.498553 -1.098702
C  3.397487 -1.434734 0.677394
C  5.094708 -0.541473 -0.74405
C  4.671054 -1.523353 0.137121
C  1.877221 -3.120181 1.276736
C  1.486642 -3.412153 -0.025583
C  1.148646 -3.611815 2.352653
C  0.36692 -4.202716 -0.238854
C  0.033815 -4.401645 2.122616
C  -0.366116 -4.700292 0.827897
H  -3.515864 0.810694 -1.47969
H  -1.277397 0.383213 -2.243553
H  -3.515737 -2.16772 -0.866811
H  -2.913942 -1.361544 -2.312542
H  -1.864096 -2.456835 -1.411527
H  -0.959583 -1.757606 0.873518
H  -1.401578 -0.213757 1.585643
H  -2.605128 -1.488442 1.426284
H  -2.747983 1.484112 1.423016
H  2.492529 2.297819 -1.743987
H  1.917065 2.401819 -0.077552
H  1.587587 -0.318381 0.831375
H  4.582493 1.243808 -1.809956
H  6.085106 -0.600631 -1.175258
H  5.314983 -2.350176 0.405795
H  2.051207 -3.037043 -0.869095
H  1.462757 -3.375036 3.360637
H  0.073393 -4.435554 -1.254382
H  -0.529302 -4.780908 2.965071
H  -1.237727 -5.315896 0.652501
totalener: -1958.42397323 hartree
nucrepener: 2580.69898916 hartree
electener: -4539.12296239 hartree
oneelecener: -7814.52733196 hartree
twoeener: 3275.40436957 hartree
kineticenergy: 1952.61729872 hartree
xcener: -143.516932528025 hartree
chargesum: 0.0000000
charge: -0.053455 -0.045439 -0.263245 -0.391792 -0.299039 0.116120 -0.026005 -0.024891 -0.237419 -0.259180 -0.159169 0.314858 0.025641 0.065872 -0.002714 -0.131853 -0.176822 0.175508 -0.089744 -0.183304 0.198710 -0.095181 -0.166123 -0.195652 -0.107899 -0.125351 0.084781 0.082163 0.091074 0.075518 0.087251 0.038972 0.105639 0.101413 0.109001 0.094019 0.119395 0.149307 0.108941 0.126499 0.127895 0.128258 0.125885 0.132199 0.124966 0.124393
qa: -0.0535 -0.0454 -0.2632 -0.3918 -0.2990 0.1161 -0.0260 -0.0249 -0.2374 -0.2592 -0.1592 0.3149 0.0256 0.0659 -0.0027 -0.1319 -0.1768 0.1755 -0.0897 -0.1833 0.1987 -0.0952 -0.1661 -0.1957 -0.1079 -0.1254 0.0848 0.0822 0.0911 0.0755 0.0873 0.0390 0.1056 0.1014 0.1090 0.0940 0.1194 0.1493 0.1089 0.1265 0.1279 0.1283 0.1259 0.1322 0.1250 0.1244
va: 1.2758 1.2633 2.1375 2.0834 2.1036 3.7624 3.8774 3.8474 3.8960 3.9133 3.8572 4.1850 4.2477 3.8589 3.8088 3.9358 4.0060 3.8816 3.9396 4.0341 3.8570 3.8235 3.9789 3.9334 3.9448 3.8872 1.0253 1.0306 1.0041 1.0104 1.0124 1.0226 1.0238 1.0051 1.0313 0.9998 1.0131 1.0094 1.0125 0.9997 1.0104 1.0091 1.0136 0.9994 0.9993 1.0015
dispcorr: -0.026163157 hartree
energy: -1958.450136390917
dipole: 18.14325 -17.64845 0.49480 -33.00016 31.97846 -1.02171 -3.75271 2.94749 -0.80522
magnitude: 1.39179 au
magnitude: 3.53766 debye
