program: Orca
programVersion: 5.0.2
elementType: Cl Cl O O O C C C C C C C C C C C C C C C C C C C C C H H H H H H H H H H H H H H H H H H H H
charge: 0
multiplicity: 1
keywords: wb97x-d3
keywords: def2-TZVPP
keywords: def2/J RIJCOSX
keywords: DEFGRID2
keywords: scfconv7
keywords: smallprint printgap noloewdin
keywords: NOSOSCF
formula: C21H20Cl2O3
InChI: InChI=1/C21H20Cl2O3/c1-21(2)17(12-18(22)23)19(21)20(24)25-13-14-7-6-10-16(11-14)26-15-8-4-3-5-9-15/h3-12,17,19H,13H2,1-2H3
46 atoms
Cl -3.016314 3.760552 -0.969707
Cl -3.548419 3.989949 1.863121
O  0.716119 1.270135 -1.292495
O  -0.219665 1.529268 0.728818
O  2.996189 -2.741455 0.882773
C  -2.227416 -0.589701 -0.376019
C  -2.855264 0.756019 -0.503749
C  -1.45869 0.529334 -1.058069
C  -2.735455 -1.670113 -1.301413
C  -1.794574 -1.120362 0.967974
C  -3.093563 1.642133 0.654074
C  -0.292165 1.165895 -0.41338
C  -3.216496 2.95555 0.536131
C  1.955639 1.778089 -0.830831
C  2.906816 0.692781 -0.39689
C  2.46319 -0.559918 0.002549
C  4.267435 0.979237 -0.363692
C  3.37818 -1.51421 0.429253
C  5.170036 0.024013 0.073349
C  4.734977 -1.230568 0.466582
C  1.890407 -3.362868 0.38497
C  1.053206 -3.993288 1.294892
C  1.627202 -3.432938 -0.978589
C  -0.046345 -4.703803 0.837839
C  0.518979 -4.138491 -1.420844
C  -0.322173 -4.776149 -0.519388
H  -3.604389 0.852322 -1.285092
H  -1.382405 0.454212 -2.136114
H  -3.046502 -1.269505 -2.267094
H  -1.962398 -2.418967 -1.479025
H  -3.596243 -2.176732 -0.861165
H  -1.020101 -1.879577 0.8423
H  -1.406869 -0.357503 1.637638
H  -2.640791 -1.603649 1.46045
H  -3.199146 1.212182 1.641986
H  2.383406 2.326196 -1.671174
H  1.802632 2.486051 -0.01294
H  1.410672 -0.807336 -0.007837
H  4.623796 1.95232 -0.679916
H  6.227277 0.252436 0.096447
H  5.432944 -1.985954 0.801837
H  1.273868 -3.929894 2.352358
H  2.283808 -2.94775 -1.689294
H  -0.69352 -5.197755 1.550538
H  0.319063 -4.197449 -2.48284
H  -1.181486 -5.329517 -0.873322
totalener: -1958.42206606 hartree
nucrepener: 2611.82516341 hartree
electener: -4570.24722947 hartree
oneelecener: -7876.93272480 hartree
twoeener: 3306.68549533 hartree
kineticenergy: 1952.62122505 hartree
xcener: -143.519499589342 hartree
chargesum: 0.0000000
charge: -0.052098 -0.044320 -0.269051 -0.364184 -0.295725 0.123253 -0.058600 -0.070079 -0.240192 -0.253167 -0.154356 0.292641 0.055814 0.064479 0.032145 -0.160711 -0.200329 0.270898 -0.077875 -0.223780 0.240086 -0.182625 -0.157938 -0.096449 -0.124028 -0.164797 0.105705 0.080509 0.077052 0.085196 0.090052 0.036968 0.113306 0.097517 0.107774 0.106502 0.113661 0.094578 0.106118 0.124057 0.124279 0.124910 0.133527 0.125881 0.133087 0.130310
qa: -0.0521 -0.0443 -0.2691 -0.3642 -0.2957 0.1233 -0.0586 -0.0701 -0.2402 -0.2532 -0.1544 0.2926 0.0558 0.0645 0.0321 -0.1607 -0.2003 0.2709 -0.0779 -0.2238 0.2401 -0.1826 -0.1579 -0.0964 -0.1240 -0.1648 0.1057 0.0805 0.0771 0.0852 0.0901 0.0370 0.1133 0.0975 0.1078 0.1065 0.1137 0.0946 0.1061 0.1241 0.1243 0.1249 0.1335 0.1259 0.1331 0.1303
va: 1.2804 1.2645 2.1314 2.1051 2.1197 3.7312 3.8976 3.8478 3.8970 3.8917 3.8861 4.2003 4.2341 3.8839 3.7418 3.9643 4.0099 3.7926 3.9527 4.0378 3.8117 3.9742 3.9264 3.8795 3.8807 3.8999 1.0074 1.0343 1.0098 1.0176 1.0053 1.0316 1.0198 1.0015 1.0190 0.9910 1.0092 1.0043 1.0109 0.9995 1.0148 1.0149 1.0026 0.9997 0.9984 0.9996
dispcorr: -0.026780792 hartree
energy: -1958.448846847670
dipole: 12.06360 -12.01103 0.05257 -33.60911 32.66376 -0.94535 -6.00413 5.24335 -0.76078
magnitude: 1.21459 au
magnitude: 3.08725 debye
