program: Orca
programVersion: 5.0.2
elementType: Cl Cl O O O C C C C C C C C C C C C C C C C C C C C C H H H H H H H H H H H H H H H H H H H H
charge: 0
multiplicity: 1
keywords: wb97x-d3
keywords: def2-TZVPP
keywords: def2/J RIJCOSX
keywords: DEFGRID2
keywords: scfconv7
keywords: smallprint printgap noloewdin
keywords: NOSOSCF
formula: C21H20Cl2O3
InChI: InChI=1/C21H20Cl2O3/c1-21(2)17(12-18(22)23)19(21)20(24)25-13-14-7-6-10-16(11-14)26-15-8-4-3-5-9-15/h3-12,17,19H,13H2,1-2H3
46 atoms
Cl -2.739912 0.870147 2.610643
Cl -1.180292 -1.490507 2.001715
O  0.516204 2.174213 0.074304
O  -0.030289 4.233344 0.739351
O  2.553846 -2.497947 0.061456
C  -1.957683 2.192514 -1.673441
C  -2.360878 1.603501 -0.361741
C  -1.656486 2.956632 -0.400074
C  -3.062311 2.781628 -2.52112
C  -0.872592 1.554922 -2.508503
C  -1.726353 0.385737 0.177843
C  -0.322217 3.202691 0.195024
C  -1.868367 -0.023816 1.430373
C  1.823036 2.311849 0.631321
C  2.642323 1.159293 0.131766
C  2.210275 -0.144184 0.348309
C  3.829914 1.381241 -0.553546
C  2.95086 -1.207829 -0.143732
C  4.580209 0.309664 -1.015142
C  4.139567 -0.989569 -0.825161
C  1.305916 -2.882947 -0.328191
C  0.62809 -2.286921 -1.385289
C  0.737564 -3.948897 0.356607
C  -0.628272 -2.758236 -1.738204
C  -0.514238 -4.411575 -0.012496
C  -1.208487 -3.81563 -1.055491
H  -3.412834 1.692708 -0.105506
H  -2.306547 3.80337 -0.214779
H  -3.51863 2.011768 -3.145959
H  -3.852682 3.225314 -1.914804
H  -2.674595 3.559945 -3.180335
H  -1.312909 0.785598 -3.14668
H  -0.415258 2.297676 -3.163768
H  -0.074208 1.096378 -1.933101
H  -1.144946 -0.247617 -0.480535
H  2.269738 3.263428 0.336588
H  1.753781 2.307747 1.722502
H  1.294405 -0.334254 0.895873
H  4.170091 2.393978 -0.729871
H  5.506035 0.48779 -1.545625
H  4.706811 -1.832298 -1.197312
H  1.072952 -1.46895 -1.937446
H  1.280374 -4.405665 1.1737
H  -1.152058 -2.294069 -2.564063
H  -0.953574 -5.239968 0.527481
H  -2.188742 -4.175488 -1.335841
totalener: -1958.41976348 hartree
nucrepener: 2724.50455931 hartree
electener: -4682.92432279 hartree
oneelecener: -8101.93014522 hartree
twoeener: 3419.00582243 hartree
kineticenergy: 1952.63199252 hartree
xcener: -143.519202432153 hartree
chargesum: 0.0000000
charge: -0.043270 -0.045834 -0.263085 -0.356544 -0.297763 0.107076 -0.013025 -0.115007 -0.236757 -0.255725 -0.115734 0.347111 0.020755 0.048372 0.004270 -0.173534 -0.149721 0.226218 -0.099608 -0.188870 0.250636 -0.154970 -0.228046 -0.137222 -0.091269 -0.130471 0.099342 0.088445 0.087199 0.075754 0.093890 0.091260 0.098662 0.065342 0.066374 0.093031 0.114437 0.106900 0.113902 0.127420 0.127980 0.140284 0.125050 0.128181 0.124817 0.123746
qa: -0.0433 -0.0458 -0.2631 -0.3565 -0.2978 0.1071 -0.0130 -0.1150 -0.2368 -0.2557 -0.1157 0.3471 0.0208 0.0484 0.0043 -0.1735 -0.1497 0.2262 -0.0996 -0.1889 0.2506 -0.1550 -0.2280 -0.1372 -0.0913 -0.1305 0.0993 0.0884 0.0872 0.0758 0.0939 0.0913 0.0987 0.0653 0.0664 0.0930 0.1144 0.1069 0.1139 0.1274 0.1280 0.1403 0.1251 0.1282 0.1248 0.1237
va: 1.2886 1.2762 2.0926 2.1526 2.1151 3.7636 3.7841 3.8991 3.9086 3.9225 3.7646 4.2165 4.2205 3.8382 3.7506 3.9291 3.9687 3.8083 3.9465 4.0308 3.7875 3.8238 3.9888 3.8942 3.9294 3.9605 1.0143 1.0300 1.0039 1.0084 1.0042 1.0007 1.0078 1.0110 1.0283 1.0150 0.9946 1.0399 1.0093 0.9997 1.0110 1.0024 1.0146 1.0024 0.9982 1.0001
dispcorr: -0.029753447 hartree
energy: -1958.449516930197
dipole: 3.88439 -3.99126 -0.10686 6.73232 -7.10688 -0.37455 -27.59628 26.40311 -1.19317
magnitude: 1.25513 au
magnitude: 3.19030 debye
